program: Orca
programVersion: 5.0.2
elementType: O O O C C C C C C C C C C C C C C C C C C C C C C H H H H H H H H H H H H H H H H H H H H H H H H H H
charge: 0
multiplicity: 1
keywords: wb97x-d3
keywords: def2-TZVPP
keywords: def2/J RIJCOSX
keywords: DEFGRID2
keywords: scfconv7
keywords: smallprint printgap noloewdin
keywords: NOSOSCF
formula: C22H26O3
InChI: InChI=1/C22H26O3/c1-15(2)10-19-20(22(19,3)4)21(23)25-14-17-12-18(24-13-17)11-16-8-6-5-7-9-16/h5-10,12-13,19-20H,11,14H2,1-4H3
51 atoms
O  1.571464 -1.860938 -0.504888
O  0.569824 -0.526685 -1.995594
O  -2.144073 -2.725969 1.519576
C  1.803708 1.660449 -0.060792
C  2.540726 1.616747 -1.354751
C  2.312851 0.325949 -0.592064
C  2.507473 2.165436 1.175239
C  0.326573 1.970732 -0.063133
C  3.918005 2.151312 -1.508525
C  1.391666 -0.693507 -1.120467
C  4.773912 1.77947 -2.463731
C  6.13999 2.385041 -2.569285
C  4.453017 0.743446 -3.496672
C  0.669675 -2.943248 -0.804605
C  -0.630179 -2.75816 -0.105458
C  -1.811877 -2.099933 -0.579205
C  -0.898834 -3.117516 1.17214
C  -2.696056 -2.103705 0.444321
C  -4.031142 -1.479815 0.624376
C  -3.920172 -0.205357 1.430002
C  -3.311621 0.916981 0.871668
C  -4.374277 -0.140033 2.742006
C  -3.160684 2.08086 1.60992
C  -4.224375 1.025545 3.485229
C  -3.616405 2.13788 2.922079
H  1.907937 1.714716 -2.232951
H  3.164971 -0.075051 -0.055066
H  2.021442 1.779241 2.072821
H  2.467543 3.255318 1.222706
H  3.554749 1.867536 1.215095
H  -0.167237 1.705825 -0.995707
H  0.179431 3.041865 0.088919
H  -0.182849 1.451894 0.7511
H  4.234856 2.90989 -0.798609
H  6.914059 1.61783 -2.486686
H  6.28382 2.862882 -3.54177
H  6.320249 3.131954 -1.796455
H  5.206096 -0.048717 -3.492602
H  3.478656 0.278244 -3.354475
H  4.472405 1.178884 -4.499363
H  1.182077 -3.830569 -0.4398
H  0.539922 -3.04737 -1.881574
H  -1.97845 -1.675874 -1.55632
H  -0.323396 -3.640026 1.920935
H  -4.720365 -2.174218 1.110236
H  -4.437552 -1.264777 -0.365094
H  -2.948052 0.877358 -0.149102
H  -4.84995 -1.005468 3.187989
H  -2.685266 2.944127 1.161399
H  -4.582749 1.061728 4.505961
H  -3.497668 3.044913 3.500457
elementType: O C H
totalener: -1079.73915030 hartree
nucrepener: 2142.64394986 hartree
electener: -3222.38310015 hartree
oneelecener: -5724.97063090 hartree
twoeener: 2502.58753074 hartree
cpcmener: -0.02880235 hartree
kineticenergy: 1074.86211247 hartree
xcener: -106.461950337637 hartree
chargesum: 0.0000000
charge: -0.288275 -0.507152 -0.283050 0.180808 -0.040230 -0.098088 -0.295551 -0.304925 -0.285630 0.422196 -0.016075 -0.229350 -0.244951 0.074360 -0.083054 -0.320527 -0.034995 0.207819 -0.053443 0.044130 -0.213989 -0.195612 -0.169946 -0.154701 -0.173249 0.101498 0.093694 0.098743 0.100752 0.093483 0.094991 0.100832 0.103187 0.126020 0.095299 0.095385 0.089935 0.096039 0.078905 0.101245 0.123155 0.120778 0.161250 0.179297 0.108328 0.117307 0.153306 0.142207 0.167045 0.159909 0.160893
qa: -0.2883 -0.5072 -0.2831 0.1808 -0.0402 -0.0981 -0.2956 -0.3049 -0.2856 0.4222 -0.0161 -0.2294 -0.2450 0.0744 -0.0831 -0.3205 -0.0350 0.2078 -0.0534 0.0441 -0.2140 -0.1956 -0.1699 -0.1547 -0.1732 0.1015 0.0937 0.0987 0.1008 0.0935 0.0950 0.1008 0.1032 0.1260 0.0953 0.0954 0.0899 0.0960 0.0789 0.1012 0.1232 0.1208 0.1613 0.1793 0.1083 0.1173 0.1533 0.1422 0.1670 0.1599 0.1609
va: 2.1197 1.9881 2.2661 3.7013 3.8438 3.8132 3.9090 3.8890 3.8799 4.1177 3.7068 3.9281 3.9403 3.8397 3.6425 3.9769 3.9653 3.6300 3.8214 3.5966 3.9100 3.9483 3.8835 3.8873 3.9007 1.0248 1.0326 1.0026 0.9987 1.0011 1.0148 1.0022 0.9931 1.0018 0.9963 0.9956 1.0063 0.9987 1.0168 0.9985 0.9967 1.0065 1.0170 0.9924 1.0117 1.0071 0.9972 1.0034 0.9852 0.9896 0.9895
dispcorr: -0.024929325 hartree
energy: -1079.764079623150
dipole: 20.25050 -19.63480 0.61569 16.67668 -16.78080 -0.10412 -6.38435 6.83534 0.45099
magnitude: 0.77027 au
magnitude: 1.95787 debye
