program: Orca
programVersion: 5.0.2
elementType: O O O C C C C C C C C C C C C C C C C C C C C C C H H H H H H H H H H H H H H H H H H H H H H H H H H
charge: 0
multiplicity: 1
keywords: wb97x-d3
keywords: def2-TZVPP
keywords: def2/J RIJCOSX
keywords: DEFGRID2
keywords: scfconv7
keywords: smallprint printgap noloewdin
keywords: NOSOSCF
formula: C22H26O3
InChI: InChI=1/C22H26O3/c1-15(2)10-19-20(22(19,3)4)21(23)25-14-17-12-18(24-13-17)11-16-8-6-5-7-9-16/h5-10,12-13,19-20H,11,14H2,1-4H3
51 atoms
O  1.6983 -2.282248 -1.029934
O  2.476579 -1.86387 1.027603
O  -2.608259 -2.507298 -0.378998
C  4.016948 0.488754 -0.352286
C  2.72443 0.986033 0.208962
C  2.735098 -0.238232 -0.709444
C  4.672418 1.227462 -1.495745
C  5.023634 -0.128238 0.588043
C  2.066208 2.230626 -0.227549
C  2.322002 -1.52404 -0.125539
C  1.187727 2.950354 0.480677
C  0.637551 4.234746 -0.062367
C  0.680472 2.591376 1.843943
C  0.931736 -3.411239 -0.569157
C  -0.436702 -2.950223 -0.215176
C  -0.820997 -2.081335 0.859805
C  -1.564557 -3.169411 -0.929051
C  -2.141537 -1.835777 0.706367
C  -3.07707 -0.925148 1.409761
C  -3.41454 0.292154 0.576595
C  -2.40209 1.059485 0.002462
C  -4.737081 0.668931 0.37144
C  -2.707376 2.174504 -0.763833
C  -5.046148 1.789424 -0.391085
C  -4.032455 2.543744 -0.963479
H  2.578918 0.725904 1.251557
H  2.385035 -0.071902 -1.72154
H  5.230857 2.089002 -1.125144
H  3.960062 1.584907 -2.23807
H  5.377436 0.57281 -2.010805
H  4.575354 -0.556098 1.481049
H  5.730384 0.637242 0.913349
H  5.596914 -0.91048 0.086967
H  2.332828 2.598214 -1.21382
H  0.909263 5.075869 0.581156
H  1.001891 4.449058 -1.066797
H  -0.454691 4.213283 -0.092696
H  -0.411369 2.631067 1.862192
H  0.978393 1.601054 2.18237
H  1.024834 3.315426 2.587205
H  1.433405 -3.90793 0.260824
H  0.899992 -4.104807 -1.407564
H  -0.194671 -1.673226 1.636648
H  -1.767652 -3.754426 -1.812698
H  -2.599157 -0.616668 2.342125
H  -3.995669 -1.447774 1.686949
H  -1.364319 0.78108 0.14891
H  -5.534459 0.079767 0.808748
H  -1.908843 2.754428 -1.20896
H  -6.081412 2.066807 -0.542337
H  -4.271209 3.412315 -1.563232
elementType: O C H
totalener: -1079.73918888 hartree
nucrepener: 2180.93696632 hartree
electener: -3260.67615521 hartree
oneelecener: -5801.01871057 hartree
twoeener: 2540.34255537 hartree
cpcmener: -0.02918685 hartree
kineticenergy: 1074.84942853 hartree
xcener: -106.461929947877 hartree
chargesum: 0.0000000
charge: -0.294489 -0.505626 -0.287939 0.117358 0.004244 -0.074343 -0.289310 -0.275317 -0.250523 0.414234 -0.064606 -0.227124 -0.268117 0.087102 -0.090805 -0.308013 -0.037156 0.199250 -0.036127 0.031541 -0.221492 -0.190813 -0.158710 -0.147125 -0.185433 0.099610 0.093551 0.101496 0.092120 0.098432 0.089806 0.095491 0.098768 0.119105 0.103320 0.093040 0.085908 0.092713 0.093104 0.111200 0.117541 0.120011 0.169676 0.178860 0.112745 0.104572 0.150170 0.142815 0.175836 0.159829 0.159618
qa: -0.2945 -0.5056 -0.2879 0.1174 0.0042 -0.0743 -0.2893 -0.2753 -0.2505 0.4142 -0.0646 -0.2271 -0.2681 0.0871 -0.0908 -0.3080 -0.0372 0.1992 -0.0361 0.0315 -0.2215 -0.1908 -0.1587 -0.1471 -0.1854 0.0996 0.0936 0.1015 0.0921 0.0984 0.0898 0.0955 0.0988 0.1191 0.1033 0.0930 0.0859 0.0927 0.0931 0.1112 0.1175 0.1200 0.1697 0.1789 0.1127 0.1046 0.1502 0.1428 0.1758 0.1598 0.1596
va: 2.1099 1.9877 2.2646 3.7242 3.7945 3.8014 3.9166 3.8918 3.8617 4.1439 3.7454 3.9150 3.9318 3.8274 3.7168 3.9642 3.9663 3.6527 3.8206 3.6489 3.9053 3.9295 3.8763 3.8825 3.9228 1.0246 1.0348 0.9999 1.0055 1.0011 1.0208 0.9997 0.9994 1.0111 0.9970 1.0073 0.9987 0.9960 1.0097 0.9988 1.0127 0.9978 1.0131 0.9934 1.0046 1.0123 0.9906 1.0022 0.9782 0.9894 0.9916
dispcorr: -0.025732682 hartree
energy: -1079.764921566397
dipole: 14.50159 -14.70470 -0.20311 20.18433 -19.54976 0.63457 1.80437 -2.33230 -0.52793
magnitude: 0.85008 au
magnitude: 2.16074 debye
