program: Orca
programVersion: 5.0.2
elementType: O O O C C C C C C C C C C C C C C C C C C C C C C H H H H H H H H H H H H H H H H H H H H H H H H H H
charge: 0
multiplicity: 1
keywords: wb97x-d3
keywords: def2-TZVPP
keywords: def2/J RIJCOSX
keywords: DEFGRID2
keywords: scfconv7
keywords: smallprint printgap noloewdin
keywords: NOSOSCF
formula: C22H26O3
InChI: InChI=1/C22H26O3/c1-15(2)10-19-20(22(19,3)4)21(23)25-14-17-12-18(24-13-17)11-16-8-6-5-7-9-16/h5-10,12-13,19-20H,11,14H2,1-4H3
51 atoms
O  1.422842 -1.647626 -1.090418
O  2.299888 -2.06273 0.92355
O  -1.908913 -2.900741 1.40907
C  1.534598 1.269779 0.118567
C  2.384203 1.084458 -1.107735
C  2.517312 0.111912 0.040382
C  1.873004 2.359703 1.105612
C  0.04885 1.023953 0.003262
C  3.531873 1.965609 -1.414271
C  2.077451 -1.296007 0.011125
C  3.718319 2.666187 -2.537366
C  4.943674 3.510147 -2.719996
C  2.763737 2.69317 -3.691512
C  0.756605 -2.926349 -1.097931
C  -0.492335 -2.846218 -0.29784
C  -1.706733 -2.188869 -0.677734
C  -0.678476 -3.257405 0.978124
C  -2.5290 -2.243131 0.394595
C  -3.851272 -1.624059 0.677276
C  -3.664722 -0.211053 1.179351
C  -3.306725 0.033469 2.503018
C  -3.778432 0.865349 0.304615
C  -3.062942 1.328314 2.940563
C  -3.538977 2.161921 0.740737
C  -3.176458 2.3968 2.06014
H  1.836637 0.714011 -1.967104
H  3.392751 0.240235 0.668613
H  2.945799 2.497781 1.233249
H  1.450626 2.130552 2.085746
H  1.450122 3.312391 0.78064
H  -0.211132 0.335264 -0.797483
H  -0.460398 1.966795 -0.205454
H  -0.360244 0.629559 0.93664
H  4.294065 2.037071 -0.643077
H  5.495459 3.212617 -3.615402
H  4.677803 4.561446 -2.858348
H  5.621092 3.443204 -1.868931
H  1.871072 2.091055 -3.536234
H  2.439664 3.717262 -3.891921
H  3.250623 2.342188 -4.604526
H  1.422177 -3.712067 -0.74106
H  0.542661 -3.115493 -2.147911
H  -1.92335 -1.717694 -1.624051
H  -0.057711 -3.80014 1.673462
H  -4.400298 -2.222832 1.406939
H  -4.438792 -1.6166 -0.241346
H  -3.216438 -0.7934 3.197695
H  -4.055869 0.687024 -0.7277
H  -2.783628 1.503233 3.971635
H  -3.635297 2.988207 0.048185
H  -2.987425 3.406073 2.401862
elementType: O C H
totalener: -1079.73820776 hartree
nucrepener: 2182.84207362 hartree
electener: -3262.58028138 hartree
oneelecener: -5805.02363327 hartree
twoeener: 2542.44335189 hartree
cpcmener: -0.03155697 hartree
kineticenergy: 1074.85930509 hartree
xcener: -106.463144757271 hartree
chargesum: -0.0000000
charge: -0.280883 -0.497942 -0.281930 0.166218 0.061639 -0.139997 -0.275187 -0.332880 -0.305369 0.423832 -0.041252 -0.224387 -0.253265 0.073729 -0.044506 -0.409977 -0.023698 0.247857 -0.042510 0.019435 -0.189316 -0.170931 -0.162792 -0.183134 -0.161787 0.099089 0.093486 0.091108 0.097931 0.096203 0.102170 0.104510 0.097162 0.122080 0.093681 0.094373 0.089154 0.088789 0.096125 0.097015 0.120882 0.120602 0.166003 0.175860 0.112484 0.107652 0.141711 0.140589 0.159686 0.159817 0.160869
qa: -0.2809 -0.4979 -0.2819 0.1662 0.0616 -0.1400 -0.2752 -0.3329 -0.3054 0.4238 -0.0413 -0.2244 -0.2533 0.0737 -0.0445 -0.4100 -0.0237 0.2479 -0.0425 0.0194 -0.1893 -0.1709 -0.1628 -0.1831 -0.1618 0.0991 0.0935 0.0911 0.0979 0.0962 0.1022 0.1045 0.0972 0.1221 0.0937 0.0944 0.0892 0.0888 0.0961 0.0970 0.1209 0.1206 0.1660 0.1759 0.1125 0.1077 0.1417 0.1406 0.1597 0.1598 0.1609
va: 2.1153 1.9938 2.2669 3.6698 3.7324 3.8737 3.9023 3.9201 3.8566 4.1634 3.7467 3.9228 3.9433 3.8330 3.6120 3.9646 3.9652 3.5544 3.8093 3.6165 3.9236 3.8697 3.8992 3.8630 3.8562 1.0247 1.0353 1.0051 1.0020 1.0028 1.0069 0.9981 0.9947 1.0090 0.9959 0.9960 1.0085 1.0100 0.9973 0.9967 1.0091 0.9953 1.0069 1.0013 1.0137 1.0110 1.0104 1.0040 0.9902 0.9910 0.9892
dispcorr: -0.026684371 hartree
energy: -1079.764892134170
dipole: 11.60837 -12.39239 -0.78401 23.06915 -22.08917 0.97998 -10.57060 9.23901 -1.33160
magnitude: 1.82981 au
magnitude: 4.65100 debye
