program: Orca
programVersion: 5.0.2
elementType: O O O C C C C C C C C C C C C C C C C C C C C C C H H H H H H H H H H H H H H H H H H H H H H H H H H
charge: 0
multiplicity: 1
keywords: wb97x-d3
keywords: def2-TZVPP
keywords: def2/J RIJCOSX
keywords: DEFGRID2
keywords: scfconv7
keywords: smallprint printgap noloewdin
keywords: NOSOSCF
formula: C22H26O3
InChI: InChI=1/C22H26O3/c1-15(2)10-19-20(22(19,3)4)21(23)25-14-17-12-18(24-13-17)11-16-8-6-5-7-9-16/h5-10,12-13,19-20H,11,14H2,1-4H3
51 atoms
O  1.492501 -1.616337 -0.881812
O  1.860917 -1.43093 1.316882
O  -2.702045 -2.354626 -0.662306
C  0.988138 1.464057 -0.445318
C  2.11713 1.160634 -1.375903
C  2.087726 0.497361 -0.02008
C  0.967536 2.783639 0.286659
C  -0.394026 0.947012 -0.769097
C  3.166354 2.169737 -1.679512
C  1.808709 -0.931338 0.212818
C  4.47615 1.924804 -1.76652
C  5.451319 3.015386 -2.089596
C  5.084687 0.572274 -1.556898
C  0.902233 -2.925316 -0.730617
C  -0.538096 -2.776081 -0.395108
C  -1.125503 -2.518607 0.885867
C  -1.547851 -2.666855 -1.2908
C  -2.434325 -2.256294 0.666042
C  -3.507627 -1.734869 1.553173
C  -3.445494 -0.224448 1.570231
C  -4.056097 0.527449 0.570265
C  -2.689188 0.431433 2.53781
C  -3.907442 1.908015 0.535779
C  -2.540047 1.811265 2.506479
C  -3.146369 2.553675 1.501243
H  1.848648 0.514216 -2.207218
H  2.766447 0.899494 0.724408
H  1.96344 3.117643 0.577243
H  0.365118 2.706596 1.194338
H  0.521666 3.561859 -0.336242
H  -0.976092 1.736218 -1.248607
H  -0.926195 0.651843 0.137683
H  -0.384253 0.098182 -1.449856
H  2.819417 3.182973 -1.864903
H  4.961478 3.980195 -2.219128
H  6.197264 3.117797 -1.297221
H  6.003889 2.790046 -3.005022
H  5.667685 0.278615 -2.433405
H  5.783649 0.58839 -0.716566
H  4.35016 -0.208619 -1.370267
H  1.446583 -3.511154 0.009036
H  1.030745 -3.399592 -1.701303
H  -0.632392 -2.506592 1.844273
H  -1.588275 -2.782424 -2.362987
H  -3.349433 -2.125785 2.55858
H  -4.487183 -2.081137 1.218203
H  -4.649945 0.032614 -0.189159
H  -2.20612 -0.145666 3.317776
H  -4.385959 2.480427 -0.248469
H  -1.948047 2.30592 3.265893
H  -3.027679 3.628964 1.471693
elementType: O C H
totalener: -1079.73517909 hartree
nucrepener: 2222.33441357 hartree
electener: -3302.06959266 hartree
oneelecener: -5884.15456968 hartree
twoeener: 2582.08497703 hartree
cpcmener: -0.02928572 hartree
kineticenergy: 1074.85955428 hartree
xcener: -106.463956885246 hartree
chargesum: 0.0000000
charge: -0.282730 -0.497658 -0.278263 0.225538 0.024769 -0.151552 -0.313150 -0.309430 -0.331542 0.426990 -0.011146 -0.231119 -0.238964 0.051328 -0.075966 -0.311124 -0.035278 0.200524 -0.042873 0.045775 -0.206540 -0.170846 -0.153723 -0.172409 -0.175137 0.108538 0.100638 0.097933 0.094422 0.100664 0.108159 0.055301 0.100839 0.122897 0.089775 0.094634 0.096546 0.102112 0.099081 0.080862 0.121167 0.120836 0.158908 0.178296 0.109538 0.110741 0.141167 0.141713 0.159014 0.160621 0.160123
qa: -0.2827 -0.4977 -0.2783 0.2255 0.0248 -0.1516 -0.3131 -0.3094 -0.3315 0.4270 -0.0111 -0.2311 -0.2390 0.0513 -0.0760 -0.3111 -0.0353 0.2005 -0.0429 0.0458 -0.2065 -0.1708 -0.1537 -0.1724 -0.1751 0.1085 0.1006 0.0979 0.0944 0.1007 0.1082 0.0553 0.1008 0.1229 0.0898 0.0946 0.0965 0.1021 0.0991 0.0809 0.1212 0.1208 0.1589 0.1783 0.1095 0.1107 0.1412 0.1417 0.1590 0.1606 0.1601
va: 2.0926 1.9929 2.2636 3.5834 3.7740 3.8600 3.9097 3.9142 3.8879 4.1059 3.7051 3.9300 3.9289 3.8620 3.6539 3.9451 3.9347 3.6418 3.8147 3.6006 3.9163 3.8727 3.8606 3.8590 3.8428 1.0193 1.0263 1.0047 1.0043 0.9987 0.9999 1.0084 1.0185 1.0037 1.0061 0.9968 0.9962 0.9995 0.9986 1.0171 1.0081 0.9986 1.0199 0.9933 1.0113 1.0140 1.0087 1.0030 0.9902 0.9906 0.9903
dispcorr: -0.029026000 hartree
energy: -1079.764205089769
dipole: 16.09046 -16.26804 -0.17758 17.55399 -17.15341 0.40058 -5.83294 4.85868 -0.97426
magnitude: 1.06826 au
magnitude: 2.71530 debye
