program: Orca
programVersion: 5.0.2
elementType: O O O C C C C C C C C C C C C C C C C C C C C C C H H H H H H H H H H H H H H H H H H H H H H H H H H
charge: 0
multiplicity: 1
keywords: wb97x-d3
keywords: def2-TZVPP
keywords: def2/J RIJCOSX
keywords: DEFGRID2
keywords: scfconv7
keywords: smallprint printgap noloewdin
keywords: NOSOSCF
formula: C22H26O3
InChI: InChI=1/C22H26O3/c1-15(2)10-19-20(22(19,3)4)21(23)25-14-17-12-18(24-13-17)11-16-8-6-5-7-9-16/h5-10,12-13,19-20H,11,14H2,1-4H3
51 atoms
O  1.886565 -2.19365 -0.860551
O  2.163752 -1.683055 1.300168
O  -2.417166 -2.11755 -0.874565
C  4.016787 0.618381 0.214713
C  2.631851 1.120508 0.417538
C  2.856155 -0.145486 -0.399772
C  4.902493 1.325344 -0.783213
C  4.780364 0.045346 1.382497
C  2.07731 2.323962 -0.251179
C  2.299199 -1.399274 0.129306
C  0.83558 2.370776 -0.74215
C  0.285402 3.599989 -1.394236
C  -0.083143 1.18125 -0.688969
C  1.02342 -3.30024 -0.534655
C  -0.373103 -2.816249 -0.360932
C  -0.998561 -2.288631 0.816998
C  -1.286806 -2.681514 -1.350967
C  -2.234426 -1.877038 0.44984
C  -3.332243 -1.191017 1.181716
C  -3.403975 0.278536 0.836707
C  -3.980991 0.70335 -0.358139
C  -2.855562 1.230413 1.691151
C  -4.000916 2.050067 -0.693857
C  -2.876554 2.57885 1.359538
C  -3.446961 2.992691 0.163343
H  2.224078 0.917619 1.405976
H  2.756466 -0.034339 -1.473221
H  5.407038 2.171579 -0.31289
H  4.345373 1.704016 -1.640176
H  5.672903 0.65056 -1.160242
H  4.136892 -0.369652 2.154352
H  5.383374 0.828405 1.845755
H  5.463143 -0.740094 1.052783
H  2.712908 3.202546 -0.317399
H  -0.042358 3.386635 -2.4149
H  -0.596893 3.960591 -0.858741
H  1.014518 4.40911 -1.4330
H  -1.118252 1.47159 -0.868705
H  0.179284 0.445728 -1.454816
H  -0.041808 0.669231 0.272995
H  1.386454 -3.832366 0.343734
H  1.097217 -3.96942 -1.389324
H  -0.578368 -2.223038 1.807662
H  -1.274193 -2.942841 -2.398006
H  -3.147784 -1.311946 2.249416
H  -4.287773 -1.676002 0.965368
H  -4.423475 -0.021299 -1.031242
H  -2.404092 0.912805 2.623652
H  -4.452321 2.364434 -1.626173
H  -2.445454 3.305845 2.035753
H  -3.463829 4.042762 -0.09829
elementType: O C H
totalener: -1079.73771880 hartree
nucrepener: 2234.58409156 hartree
electener: -3314.32181036 hartree
oneelecener: -5908.84137374 hartree
twoeener: 2594.51956338 hartree
cpcmener: -0.02729236 hartree
kineticenergy: 1074.85893303 hartree
xcener: -106.464279627670 hartree
chargesum: -0.0000000
charge: -0.295334 -0.505415 -0.284684 0.160396 0.012679 -0.085737 -0.284260 -0.283574 -0.357125 0.384212 0.053543 -0.232070 -0.277206 0.074747 -0.075404 -0.329130 -0.031906 0.215643 -0.045322 0.055770 -0.204332 -0.228988 -0.120844 -0.114919 -0.223947 0.101833 0.095646 0.099035 0.092516 0.097952 0.090199 0.094277 0.099694 0.123917 0.103833 0.092620 0.092592 0.076560 0.112137 0.092634 0.118353 0.122740 0.157960 0.176646 0.103459 0.117758 0.140245 0.141190 0.158344 0.160073 0.160994
qa: -0.2953 -0.5054 -0.2847 0.1604 0.0127 -0.0857 -0.2843 -0.2836 -0.3571 0.3842 0.0535 -0.2321 -0.2772 0.0747 -0.0754 -0.3291 -0.0319 0.2156 -0.0453 0.0558 -0.2043 -0.2290 -0.1208 -0.1149 -0.2239 0.1018 0.0956 0.0990 0.0925 0.0980 0.0902 0.0943 0.0997 0.1239 0.1038 0.0926 0.0926 0.0766 0.1121 0.0926 0.1184 0.1227 0.1580 0.1766 0.1035 0.1178 0.1402 0.1412 0.1583 0.1601 0.1610
va: 2.1016 1.9875 2.2612 3.7115 3.7778 3.8158 3.9073 3.8865 3.9169 4.1392 3.6492 3.9162 3.9607 3.8423 3.6440 3.9499 3.9465 3.6019 3.8058 3.5626 3.9407 3.9048 3.8434 3.7907 3.8797 1.0260 1.0337 1.0000 1.0021 1.0029 1.0199 1.0010 0.9988 1.0051 0.9944 0.9953 1.0077 1.0187 1.0041 1.0005 1.0101 0.9964 1.0193 0.9933 1.0135 1.0050 1.0133 1.0044 0.9903 0.9887 0.9906
dispcorr: -0.029318207 hartree
energy: -1079.767037008891
dipole: 12.56756 -12.81828 -0.25072 15.99875 -15.67916 0.31959 -1.93338 1.11715 -0.81623
magnitude: 0.91172 au
magnitude: 2.31740 debye
