program: Orca
programVersion: 5.0.2
elementType: O O O C C C C C C C C C C C C C C C C C C C C C C H H H H H H H H H H H H H H H H H H H H H H H H H H
charge: 0
multiplicity: 1
keywords: wb97x-d3
keywords: def2-TZVPP
keywords: def2/J RIJCOSX
keywords: DEFGRID2
keywords: scfconv7
keywords: smallprint printgap noloewdin
keywords: NOSOSCF
formula: C22H26O3
InChI: InChI=1/C22H26O3/c1-15(2)10-19-20(22(19,3)4)21(23)25-14-17-12-18(24-13-17)11-16-8-6-5-7-9-16/h5-10,12-13,19-20H,11,14H2,1-4H3
51 atoms
O  1.918701 -2.228153 -0.813508
O  2.130575 -1.662624 1.340475
O  -2.359845 -2.0383 -0.903188
C  4.000041 0.625312 0.224514
C  2.611276 1.124757 0.411674
C  2.843554 -0.155038 -0.377998
C  4.88765 1.30918 -0.787462
C  4.758951 0.084981 1.410728
C  2.057078 2.317444 -0.276423
C  2.290336 -1.40334 0.166988
C  0.830264 2.356256 -0.804526
C  0.291893 3.58834 -1.461594
C  -0.085622 1.163487 -0.792099
C  1.036134 -3.319984 -0.491248
C  -0.355567 -2.813057 -0.34442
C  -1.016418 -2.329658 0.83324
C  -1.223362 -2.604908 -1.362282
C  -2.226827 -1.87059 0.438184
C  -3.3437 -1.200397 1.154792
C  -3.398543 0.277736 0.846094
C  -3.990697 0.739684 -0.327031
C  -2.818653 1.200191 1.712083
C  -3.997491 2.094584 -0.629557
C  -2.827235 2.556528 1.414295
C  -3.414976 3.007973 0.240173
H  2.20598 0.941835 1.405047
H  2.751596 -0.063356 -1.453944
H  5.390447 2.168056 -0.338544
H  4.331658 1.664586 -1.655175
H  5.659437 0.625618 -1.145567
H  5.350299 0.884624 1.860938
H  5.45202 -0.701219 1.10557
H  4.112527 -0.317566 2.187185
H  2.682384 3.204951 -0.320589
H  -0.022739 3.380078 -2.48742
H  -0.596745 3.948631 -0.936145
H  1.022606 4.396598 -1.487055
H  -0.036526 0.6091 0.145284
H  -1.122558 1.460507 -0.951457
H  0.170867 0.464969 -1.593653
H  1.377075 -3.851999 0.396382
H  1.114749 -3.996015 -1.340381
H  -0.637087 -2.32643 1.842473
H  -1.172542 -2.808571 -2.420833
H  -3.195118 -1.351827 2.224203
H  -4.293513 -1.674255 0.893196
H  -4.455995 0.037672 -1.008763
H  -2.355357 0.853959 2.628475
H  -4.461844 2.438099 -1.545037
H  -2.375288 3.260878 2.100783
H  -3.423246 4.064673 0.006293
elementType: O C H
totalener: -1079.73786897 hartree
nucrepener: 2236.06456169 hartree
electener: -3315.80243065 hartree
oneelecener: -5911.84651356 hartree
twoeener: 2596.04408291 hartree
cpcmener: -0.02766726 hartree
kineticenergy: 1074.85673263 hartree
xcener: -106.463243784727 hartree
chargesum: -0.0000000
charge: -0.294581 -0.504261 -0.282764 0.159346 0.010632 -0.082037 -0.283754 -0.282381 -0.351245 0.376974 0.046175 -0.231344 -0.272126 0.077207 -0.072535 -0.316338 -0.037516 0.200177 -0.043734 0.063263 -0.203326 -0.233732 -0.123370 -0.115730 -0.223399 0.100973 0.095012 0.099058 0.092270 0.098335 0.094567 0.099456 0.089445 0.123232 0.103302 0.092853 0.092080 0.086601 0.080987 0.113167 0.118380 0.123242 0.157356 0.176377 0.104746 0.117757 0.140494 0.140986 0.158105 0.160221 0.161398
qa: -0.2946 -0.5043 -0.2828 0.1593 0.0106 -0.0820 -0.2838 -0.2824 -0.3512 0.3770 0.0462 -0.2313 -0.2721 0.0772 -0.0725 -0.3163 -0.0375 0.2002 -0.0437 0.0633 -0.2033 -0.2337 -0.1234 -0.1157 -0.2234 0.1010 0.0950 0.0991 0.0923 0.0983 0.0946 0.0995 0.0894 0.1232 0.1033 0.0929 0.0921 0.0866 0.0810 0.1132 0.1184 0.1232 0.1574 0.1764 0.1047 0.1178 0.1405 0.1410 0.1581 0.1602 0.1614
va: 2.1021 1.9880 2.2583 3.7087 3.7757 3.8157 3.9067 3.8885 3.9162 4.1522 3.6595 3.9192 3.9589 3.8388 3.6375 3.9526 3.9403 3.6174 3.8036 3.5519 3.9398 3.9097 3.8417 3.7947 3.8797 1.0266 1.0340 1.0001 1.0024 1.0028 1.0008 0.9990 1.0196 1.0052 0.9947 0.9950 1.0076 1.0006 1.0157 1.0029 1.0093 0.9963 1.0181 0.9935 1.0132 1.0051 1.0121 1.0047 0.9904 0.9886 0.9905
dispcorr: -0.029319592 hartree
energy: -1079.767188558222
dipole: 12.41435 -12.66149 -0.24714 15.89120 -15.60430 0.28689 -2.24452 1.40412 -0.84040
magnitude: 0.92177 au
magnitude: 2.34294 debye
