program: Orca
programVersion: 5.0.2
elementType: O O O C C C C C C C C C C C C C C C C C C C C C C H H H H H H H H H H H H H H H H H H H H H H H H H H
charge: 0
multiplicity: 1
keywords: wb97x-d3
keywords: def2-TZVPP
keywords: def2/J RIJCOSX
keywords: DEFGRID2
keywords: scfconv7
keywords: smallprint printgap noloewdin
keywords: NOSOSCF
formula: C22H26O3
InChI: InChI=1/C22H26O3/c1-15(2)10-19-20(22(19,3)4)21(23)25-14-17-12-18(24-13-17)11-16-8-6-5-7-9-16/h5-10,12-13,19-20H,11,14H2,1-4H3
51 atoms
O  1.706258 -2.047954 -1.132059
O  2.209484 -1.865045 1.038913
O  -2.00958 -2.635274 1.199488
C  3.843519 0.665843 0.240118
C  2.432151 1.103973 0.432757
C  2.732282 -0.081586 -0.47429
C  4.733731 1.480608 -0.667823
C  4.592546 0.055807 1.399141
C  1.900445 2.365144 -0.143858
C  2.21949 -1.402979 -0.08058
C  0.779176 2.472171 -0.861505
C  0.323233 3.790982 -1.404412
C  -0.092632 1.299013 -1.203684
C  0.940112 -3.240233 -0.882771
C  -0.372014 -2.895384 -0.275357
C  -1.423428 -2.129363 -0.875443
C  -0.786901 -3.168921 0.982622
C  -2.389126 -1.993071 0.062882
C  -3.669748 -1.235761 0.089319
C  -3.454314 0.246934 0.295356
C  -3.971953 1.167567 -0.609842
C  -2.721318 0.719504 1.383337
C  -3.767072 2.531222 -0.434739
C  -2.512268 2.079176 1.55887
C  -3.035142 2.9919 0.649869
H  2.008003 0.819714 1.394027
H  2.659143 0.12256 -1.536258
H  5.547268 0.865814 -1.057191
H  5.181999 2.311621 -0.119907
H  4.194172 1.894965 -1.519411
H  5.321997 -0.67996 1.054975
H  3.944228 -0.425335 2.1269
H  5.143686 0.83991 1.922134
H  2.47414 3.265694 0.060132
H  -0.655336 4.060079 -0.9982
H  1.01996 4.597015 -1.175397
H  0.202696 3.743793 -2.489918
H  0.182174 0.878097 -2.174877
H  -0.033301 0.49945 -0.467926
H  -1.137562 1.603028 -1.282732
H  1.497088 -3.94224 -0.261109
H  0.815168 -3.68974 -1.866491
H  -1.445137 -1.719995 -1.87376
H  -0.341503 -3.714732 1.799551
H  -4.313009 -1.634547 0.877847
H  -4.198385 -1.395451 -0.851433
H  -4.538873 0.815759 -1.463702
H  -2.306862 0.022425 2.102091
H  -4.177026 3.232076 -1.15062
H  -1.939301 2.428033 2.408408
H  -2.871297 4.052867 0.787141
elementType: O C H
totalener: -1079.73731514 hartree
nucrepener: 2239.21870910 hartree
electener: -3318.95602425 hartree
oneelecener: -5918.09714631 hartree
twoeener: 2599.14112206 hartree
cpcmener: -0.02835232 hartree
kineticenergy: 1074.85500241 hartree
xcener: -106.464345696406 hartree
chargesum: 0.0000000
charge: -0.292558 -0.502064 -0.283823 0.164302 0.011940 -0.126919 -0.283049 -0.290824 -0.321598 0.401827 0.003056 -0.227904 -0.250696 0.092004 -0.044165 -0.421628 -0.026964 0.267740 -0.032538 -0.004672 -0.173682 -0.201364 -0.134479 -0.136708 -0.208305 0.104103 0.094875 0.098688 0.098731 0.091895 0.099284 0.091205 0.093964 0.123358 0.093297 0.090799 0.100950 0.122955 0.069021 0.092502 0.118550 0.123602 0.162564 0.178349 0.110601 0.103648 0.140672 0.139810 0.158046 0.159187 0.162413
qa: -0.2926 -0.5021 -0.2838 0.1643 0.0119 -0.1269 -0.2830 -0.2908 -0.3216 0.4018 0.0031 -0.2279 -0.2507 0.0920 -0.0442 -0.4216 -0.0270 0.2677 -0.0325 -0.0047 -0.1737 -0.2014 -0.1345 -0.1367 -0.2083 0.1041 0.0949 0.0987 0.0987 0.0919 0.0993 0.0912 0.0940 0.1234 0.0933 0.0908 0.1010 0.1230 0.0690 0.0925 0.1186 0.1236 0.1626 0.1783 0.1106 0.1036 0.1407 0.1398 0.1580 0.1592 0.1624
va: 2.1049 1.9946 2.2639 3.6937 3.7798 3.8451 3.9046 3.8876 3.8930 4.1456 3.6929 3.9237 3.9265 3.8327 3.5959 3.9526 3.9590 3.5338 3.7942 3.6589 3.8988 3.8644 3.8395 3.8288 3.8605 1.0231 1.0308 1.0028 1.0009 1.0031 0.9988 1.0210 1.0005 1.0041 0.9957 1.0075 0.9952 1.0021 1.0008 1.0053 1.0083 0.9914 1.0083 0.9963 1.0109 1.0096 1.0032 1.0150 0.9911 0.9910 0.9893
dispcorr: -0.029332745 hartree
energy: -1079.766647888610
dipole: 11.62168 -12.05310 -0.43141 17.86434 -17.31375 0.55058 -5.53148 4.23348 -1.29800
magnitude: 1.47447 au
magnitude: 3.74781 debye
