program: Orca
programVersion: 5.0.2
elementType: O O O C C C C C C C C C C C C C C C C C C C C C C H H H H H H H H H H H H H H H H H H H H H H H H H H
charge: 0
multiplicity: 1
keywords: wb97x-d3
keywords: def2-TZVPP
keywords: def2/J RIJCOSX
keywords: DEFGRID2
keywords: scfconv7
keywords: smallprint printgap noloewdin
keywords: NOSOSCF
formula: C22H26O3
InChI: InChI=1/C22H26O3/c1-15(2)10-19-20(22(19,3)4)21(23)25-14-17-12-18(24-13-17)11-16-8-6-5-7-9-16/h5-10,12-13,19-20H,11,14H2,1-4H3
51 atoms
O  1.584869 -1.833452 0.500137
O  1.488085 -1.42011 -1.695497
O  -2.686219 -2.205915 -0.387514
C  2.052417 1.505593 -0.652934
C  3.282789 0.932489 -1.288487
C  2.563296 0.135909 -0.227566
C  2.204268 2.602847 0.370776
C  0.807443 1.641847 -1.493819
C  4.638061 1.464448 -1.006891
C  1.833789 -1.095483 -0.581069
C  5.348635 2.226056 -1.843757
C  6.723923 2.702301 -1.488149
C  4.858527 2.663479 -3.190428
C  0.811728 -3.036317 0.333493
C  -0.645003 -2.735777 0.307273
C  -1.507557 -2.603002 1.443144
C  -1.420374 -2.482583 -0.773739
C  -2.732636 -2.281784 0.968292
C  -4.018584 -1.955872 1.633795
C  -4.29533 -0.469791 1.637017
C  -3.467784 0.391786 2.35456
C  -5.364586 0.063982 0.92728
C  -3.707644 1.757227 2.365616
C  -5.607192 1.433068 0.935052
C  -4.78057 2.283029 1.654834
H  3.124465 0.572645 -2.300641
H  3.025104 0.115217 0.753863
H  1.308671 2.672784 0.990788
H  2.341825 3.567986 -0.120849
H  3.053997 2.443301 1.033375
H  -0.095036 1.522965 -0.891105
H  0.76286 0.92826 -2.313694
H  0.776956 2.640493 -1.934283
H  5.072519 1.21293 -0.043532
H  6.777019 3.793753 -1.507293
H  7.035642 2.365001 -0.499947
H  7.460186 2.346541 -2.213713
H  5.453434 2.20996 -3.987777
H  3.81339 2.418437 -3.371429
H  4.96996 3.74453 -3.302874
H  1.058784 -3.64283 1.202601
H  1.132533 -3.577611 -0.55615
H  -1.23945 -2.735232 2.479845
H  -1.225598 -2.475834 -1.834399
H  -3.962989 -2.324677 2.659488
H  -4.842882 -2.486014 1.150958
H  -2.62795 -0.010865 2.909507
H  -6.015928 -0.594594 0.364956
H  -3.058208 2.412733 2.93158
H  -6.444915 1.833247 0.378527
H  -4.969528 3.348597 1.664282
elementType: O C H
totalener: -1079.74024160 hartree
nucrepener: 2086.67971232 hartree
electener: -3166.41995393 hartree
oneelecener: -5612.91321393 hartree
twoeener: 2446.49326000 hartree
cpcmener: -0.02978139 hartree
kineticenergy: 1074.85593796 hartree
xcener: -106.460150546499 hartree
chargesum: 0.0000000
charge: -0.289544 -0.501974 -0.285180 0.155350 0.002637 -0.137591 -0.266053 -0.298244 -0.281101 0.425843 -0.028518 -0.228825 -0.254751 0.092317 -0.082402 -0.329897 -0.021334 0.207166 -0.052144 0.026093 -0.194530 -0.195413 -0.163095 -0.153874 -0.175780 0.096375 0.092810 0.098461 0.096150 0.091288 0.100408 0.091917 0.098189 0.125090 0.094642 0.088889 0.094592 0.100864 0.088844 0.094580 0.120706 0.122032 0.166006 0.172179 0.118707 0.106200 0.147199 0.142996 0.159984 0.160402 0.161333
qa: -0.2895 -0.5020 -0.2852 0.1554 0.0026 -0.1376 -0.2661 -0.2982 -0.2811 0.4258 -0.0285 -0.2288 -0.2548 0.0923 -0.0824 -0.3299 -0.0213 0.2072 -0.0521 0.0261 -0.1945 -0.1954 -0.1631 -0.1539 -0.1758 0.0964 0.0928 0.0985 0.0961 0.0913 0.1004 0.0919 0.0982 0.1251 0.0946 0.0889 0.0946 0.1009 0.0888 0.0946 0.1207 0.1220 0.1660 0.1722 0.1187 0.1062 0.1472 0.1430 0.1600 0.1604 0.1613
va: 2.1237 1.9971 2.2672 3.6556 3.7701 3.9078 3.9029 3.9041 3.8742 4.1545 3.6980 3.9267 3.9432 3.7993 3.6308 4.0045 3.9431 3.6143 3.8192 3.6184 3.9274 3.9448 3.9045 3.8845 3.8946 1.0252 1.0377 1.0028 1.0029 1.0029 0.9998 1.0180 1.0012 1.0068 0.9966 1.0080 0.9946 0.9971 1.0068 0.9984 0.9955 1.0108 1.0048 1.0054 1.0048 1.0122 1.0025 1.0032 0.9909 0.9898 0.9894
dispcorr: -0.022760496 hartree
energy: -1079.763002100533
dipole: 21.29112 -21.07970 0.21142 21.06517 -20.65709 0.40808 -5.76476 6.87664 1.11188
magnitude: 1.20313 au
magnitude: 3.05810 debye
