program: Orca
programVersion: 5.0.2
elementType: O O O C C C C C C C C C C C C C C C C C C C C C C H H H H H H H H H H H H H H H H H H H H H H H H H H
charge: 0
multiplicity: 1
keywords: wb97x-d3
keywords: def2-TZVPP
keywords: def2/J RIJCOSX
keywords: DEFGRID2
keywords: scfconv7
keywords: smallprint printgap noloewdin
keywords: NOSOSCF
formula: C22H26O3
InChI: InChI=1/C22H26O3/c1-15(2)10-19-20(22(19,3)4)21(23)25-14-17-12-18(24-13-17)11-16-8-6-5-7-9-16/h5-10,12-13,19-20H,11,14H2,1-4H3
51 atoms
O  1.345402 -1.804516 -1.351697
O  2.63885 -2.254062 0.417245
O  -1.437672 -1.943028 2.032323
C  4.389319 0.148702 -0.627903
C  3.412593 0.63019 0.385707
C  2.920152 -0.204571 -0.788914
C  4.914453 1.125809 -1.652488
C  5.402392 -0.898638 -0.238248
C  2.996994 2.050776 0.512127
C  2.332851 -1.520578 -0.49713
C  1.752098 2.458045 0.775835
C  1.417534 3.911658 0.910645
C  0.592155 1.522693 0.939011
C  0.424798 -2.849446 -0.988518
C  -0.501777 -2.348383 0.060512
C  -1.507662 -1.337874 -0.098078
C  -0.502726 -2.667956 1.374046
C  -2.041196 -1.127425 1.127357
C  -3.085129 -0.20029 1.644064
C  -3.780999 0.517185 0.52057
C  -4.881321 -0.059831 -0.107368
C  -3.318279 1.748661 0.067005
C  -5.509195 0.581483 -1.165886
C  -3.943026 2.392528 -0.993343
C  -5.039544 1.809488 -1.613601
H  3.43747 0.075128 1.320962
H  2.406279 0.346683 -1.567685
H  5.771025 1.673854 -1.255138
H  4.164034 1.854953 -1.957568
H  5.247069 0.598318 -2.548155
H  5.65183 -1.539092 -1.086136
H  5.072102 -1.534142 0.580084
H  6.323854 -0.408903 0.082472
H  3.777532 2.799811 0.407626
H  1.018504 4.128813 1.904664
H  2.284518 4.551273 0.747057
H  0.641658 4.202029 0.197569
H  0.00104 1.790226 1.818191
H  -0.082118 1.594686 0.081059
H  0.887095 0.480418 1.04465
H  0.950786 -3.749081 -0.668753
H  -0.106577 -3.079681 -1.91027
H  -1.783257 -0.837428 -1.013132
H  0.071974 -3.368615 1.959469
H  -2.62569 0.524491 2.323254
H  -3.812754 -0.761835 2.236569
H  -5.252872 -1.017469 0.23786
H  -2.463922 2.210157 0.54855
H  -6.366776 0.122647 -1.640718
H  -3.573398 3.351169 -1.333614
H  -5.528749 2.31107 -2.43836
elementType: O C H
totalener: -1079.73890651 hartree
nucrepener: 2175.26022436 hartree
electener: -3254.99913087 hartree
oneelecener: -5789.63744428 hartree
twoeener: 2534.63831341 hartree
cpcmener: -0.02824474 hartree
kineticenergy: 1074.85179897 hartree
xcener: -106.462270578123 hartree
chargesum: 0.0000000
charge: -0.294340 -0.499864 -0.290449 0.165328 -0.009692 -0.093074 -0.286280 -0.284148 -0.305316 0.376082 0.013821 -0.237138 -0.267257 0.100362 -0.090087 -0.344892 -0.017025 0.191193 -0.003364 0.009167 -0.190405 -0.205258 -0.158365 -0.171262 -0.163812 0.103455 0.091282 0.099776 0.093395 0.098407 0.100142 0.089962 0.094760 0.123670 0.097972 0.090597 0.094620 0.106145 0.106469 0.081659 0.116344 0.121729 0.160775 0.177500 0.109808 0.111873 0.141212 0.166364 0.159345 0.158070 0.160745
qa: -0.2943 -0.4999 -0.2904 0.1653 -0.0097 -0.0931 -0.2863 -0.2841 -0.3053 0.3761 0.0138 -0.2371 -0.2673 0.1004 -0.0901 -0.3449 -0.0170 0.1912 -0.0034 0.0092 -0.1904 -0.2053 -0.1584 -0.1713 -0.1638 0.1035 0.0913 0.0998 0.0934 0.0984 0.1001 0.0900 0.0948 0.1237 0.0980 0.0906 0.0946 0.1061 0.1065 0.0817 0.1163 0.1217 0.1608 0.1775 0.1098 0.1119 0.1412 0.1664 0.1593 0.1581 0.1607
va: 2.0950 1.9924 2.2560 3.6820 3.7973 3.8106 3.9079 3.8883 3.8974 4.1683 3.7083 3.9324 3.9551 3.8251 3.6828 3.9378 3.9478 3.6242 3.8049 3.6056 3.9294 3.9098 3.8876 3.9222 3.8849 1.0269 1.0335 0.9997 1.0017 1.0030 0.9988 1.0194 1.0007 1.0030 0.9961 1.0064 0.9966 0.9977 0.9920 1.0006 1.0115 0.9922 1.0053 0.9983 1.0036 1.0089 1.0033 0.9861 0.9900 0.9926 0.9890
dispcorr: -0.026777260 hartree
energy: -1079.765683772387
dipole: 14.12146 -14.80092 -0.67947 16.03917 -15.04187 0.99729 -2.52754 1.83121 -0.69633
magnitude: 1.39325 au
magnitude: 3.54136 debye
