program: Gaussian 09
title: 000071601
version: EM64L-G09RevD.01
frameworkgroup: C1[X(C6H6)]
method: RPBEPBE
basis: SDD
operation: Freq
keyword: #p
keyword: freq=noraman
keyword: PBEPBE/SDD
title: #p freq=noraman PBEPBE/SDD
converged: NO NO NO NO
title: Mulliken charges:
elementType: C C C C C C H H H H H H
charge: -0.225568 -0.225695 -0.225687 -0.225678 -0.225689 -0.225582 0.225614 0.225653 0.225683 0.225680 0.225649 0.225619
chargesum: 0.00000
title: Mulliken charges with hydrogens summed into heavy atoms:
elementType: C C C C C C
charge: 0.000046 -0.000042 -0.000003 0.000002 -0.000040 0.000037
polarizability: 7.17508230e+01 4.69884042e-04 7.17474883e+01 3.68687576e-09 -3.26180866e-09 2.46712745e+01
1716.lowfreq: -0.0006 -0.0005 0.0002 29.8442 32.1153 33.1462 402.4299 403.2094 602.7914
frequency: 402.4299 403.2094 602.7913 603.0630 681.3794 710.7328 854.4908 855.9054 976.4202 977.3677 981.2966 991.0800 1005.2143 1034.2435 1034.9985 1167.8513 1180.2226 1180.3175 1340.0955 1373.3391 1459.1837 1459.9026 1595.8762 1596.2612 3117.5329 3127.3330 3128.0320 3149.1689 3149.8969 3167.4044
redmass: 2.7750 2.7789 6.1396 6.1376 1.0848 3.3781 1.2465 1.2465 1.3982 1.3972 5.9115 6.5673 1.2828 1.7040 1.7006 1.0247 1.1159 1.1162 1.2465 10.0327 2.0039 2.0085 5.7809 5.7892 1.0831 1.0877 1.0877 1.0971 1.0971 1.1033
irintensity: 0.0002 0.0002 0.0000 0.0000 165.4191 0.0000 0.0000 0.0000 0.0008 0.0015 0.0000 0.0000 0.0000 9.5040 9.5463 0.0000 0.0000 0.0000 0.0000 0.0005 11.7978 11.7330 0.0000 0.0000 0.0142 0.0001 0.0000 57.3873 57.3934 0.0000
temp: 298.150 k
press: 1.00000 atm
elementType: 6 6 6 6 6 6 1 1 1 1 1 1
symmnumber: 1
zpe: 259033.6 jmol-1
zpe.correction: 0.098661 hartree
zpe.thermalcorrener: 0.103130 hartree
zpe.thermalcorrenthalpy: 0.104074 hartree
zpe.thermalcorrgfe: 0.071122 hartree
zpe.sumelectzpe: -231.808880 hartree
zpe.sumelectthermal: -231.804410 hartree
zpe.sumelectthermalent: -231.803466 hartree
zpe.sumelectthermalfe: -231.836418 hartree
dipole: 0.0000 0.0000 0.0000
dipole: 0.0000
quadrupole: -30.6331 -30.6339 -40.1375
quadrupole: 0.0003 0.0000 0.0000
quadrupole: 3.1684 3.1676 -6.3360 0.0003 0.0000 0.0000
hfenergy: -231.9075403 hartree
pointgroup: C01 [X(C6H6)]
dipole: -0.0000123 -0.0000061 -0.0000006 debye
dipolederiv: -0.0013163 0.0936983 -0.0000023 0.0939291 0.051305 0.0000017 -0.0000042 0.0000036 -0.1621189 0.1196323 -0.0241466 0.0000133 -0.0243968 -0.06895 -0.0000032 0.0000277 -0.0000063 -0.1621193 -0.0427277 -0.0694913 0.0000067 -0.0695445 0.0932733 -0.0000124 0.0000138 -0.0000257 -0.162221 -0.0427224 -0.0694857 -0.0000067 -0.0695445 0.0932895 0.0000124 -0.0000138 0.0000257 -0.1622149 0.1196419 -0.0241476 -0.0000133 -0.0243955 -0.0689485 0.0000032 -0.0000277 0.0000063 -0.1621166 -0.0013332 0.0936993 0.0000023 0.093928 0.0512871 -0.0000017 0.0000042 -0.0000036 -0.1621292 0.0043474 -0.1058495 -0.0000013 -0.105808 -0.0548411 0.0000009 -0.0000035 0.0000024 0.1620704 -0.1316646 0.027319 -0.0000085 0.0273113 0.0812146 0.0000003 -0.000013 -0.0000005 0.1621112 0.0517341 0.0784717 -0.0000026 0.0785081 -0.1019995 0.0000083 -0.0000032 0.0000131 0.1622785 0.0517373 0.0784632 0.0000026 0.0785109 -0.1020143 -0.0000083 0.0000032 -0.0000131 0.1622761 -0.1316755 0.0273183 0.0000085 0.0273023 0.081213 -0.0000003 0.000013 0.0000005 0.1621096 0.0043467 -0.1058492 0.0000013 -0.1058003 -0.0548291 -0.0000009 0.0000035 -0.0000024 0.162074 unknown
polarizability: 71.747734|-0.0009898|71.7505773|0.|0.|24.6712745 unknown
InChI: InChI=1S/C6H6/c1-2-4-6-5-3-1/h1-6H
charge 0 multiplicity 1
12 atoms
C  0.856224 1.128509 0.0000
C  1.405486 -0.177346 0.00001
C  -0.549189 1.305935 -0.000009
C  0.549235 -1.30589 -0.000009
C  -1.405441 0.177392 0.00001
C  -0.856181 -1.128484 0.0000
H  1.518907 2.001728 0.0000
H  2.493037 -0.314553 0.000047
H  -0.973977 2.316452 -0.000047
H  0.97398 -2.31643 -0.000047
H  -2.492999 0.314565 0.000047
H  -1.518883 -2.001678 0.0000
