program: Orca
programVersion: 5.0.2
elementType: O O O C C C C C C C C C C C C C C C C C C C C C C H H H H H H H H H H H H H H H H H H H H H H H H H H
charge: 0
multiplicity: 1
keywords: wb97x-d3
keywords: def2-TZVPP
keywords: def2/J RIJCOSX
keywords: DEFGRID2
keywords: scfconv7
keywords: smallprint printgap noloewdin
keywords: NOSOSCF
formula: C22H26O3
InChI: InChI=1/C22H26O3/c1-15(2)10-19-20(22(19,3)4)21(23)25-14-17-12-18(24-13-17)11-16-8-6-5-7-9-16/h5-10,12-13,19-20H,11,14H2,1-4H3
51 atoms
O  1.493574 -1.651028 -0.939726
O  2.158299 -1.914902 1.177333
O  -2.158302 -2.643764 1.271024
C  1.687071 1.357366 0.021947
C  2.615968 1.022316 -1.110908
C  2.598873 0.145792 0.121576
C  2.007389 2.506458 0.945794
C  0.20425 1.173189 -0.195609
C  3.835256 1.807611 -1.394082
C  2.070948 -1.231232 0.179606
C  4.224625 2.268843 -2.587032
C  5.513748 3.019573 -2.735789
C  3.460718 2.079913 -3.863242
C  0.778248 -2.902438 -0.901496
C  -0.544856 -2.718196 -0.251836
C  -1.687085 -2.058789 -0.812464
C  -0.893556 -3.047809 1.013003
C  -2.6339 -2.034997 0.152491
C  -3.97387 -1.400837 0.235653
C  -3.898017 -0.104393 1.007707
C  -4.237625 -0.050424 2.355131
C  -3.427263 1.049589 0.385699
C  -4.112458 1.135572 3.068493
C  -3.302675 2.235289 1.094629
C  -3.644725 2.28138 2.440666
H  2.116437 0.607707 -1.979173
H  3.428674 0.280653 0.807597
H  1.694013 3.453271 0.501611
H  3.068835 2.581435 1.177807
H  1.472694 2.392579 1.890591
H  -0.028225 0.457706 -0.981772
H  -0.244139 2.125868 -0.48462
H  -0.290823 0.844014 0.720348
H  4.478214 2.009269 -0.54191
H  6.056247 3.100147 -1.794014
H  6.169261 2.530581 -3.461459
H  5.338783 4.030285 -3.113362
H  3.421196 3.016215 -4.426098
H  3.961251 1.352203 -4.509919
H  2.436151 1.741496 -3.713017
H  1.370952 -3.671404 -0.406309
H  0.66705 -3.18349 -1.946896
H  -1.78016 -1.64655 -1.805139
H  -0.375788 -3.559445 1.809102
H  -4.691995 -2.078922 0.702052
H  -4.321723 -1.212808 -0.780843
H  -4.605511 -0.940449 2.851661
H  -3.150415 1.017806 -0.66208
H  -4.381288 1.163319 4.116558
H  -2.937362 3.123906 0.595947
H  -3.548177 3.205517 2.995449
elementType: O C H
totalener: -1079.73911923 hartree
nucrepener: 2158.81909857 hartree
electener: -3238.55821780 hartree
oneelecener: -5756.88615791 hartree
twoeener: 2518.32794010 hartree
cpcmener: -0.03245122 hartree
kineticenergy: 1074.85559580 hartree
xcener: -106.462191251729 hartree
chargesum: 0.0000000
charge: -0.280581 -0.499212 -0.285167 0.148628 0.073877 -0.130691 -0.278624 -0.325562 -0.313900 0.425711 -0.034361 -0.222479 -0.262988 0.070363 -0.046472 -0.402483 -0.020201 0.233446 -0.044952 0.089632 -0.210114 -0.258948 -0.152038 -0.150396 -0.175113 0.095847 0.092441 0.096832 0.090744 0.097869 0.099697 0.102763 0.106797 0.120485 0.088315 0.093550 0.094362 0.093807 0.102036 0.092294 0.121302 0.121494 0.164995 0.176032 0.111521 0.114925 0.143255 0.148193 0.160030 0.161783 0.161256
qa: -0.2806 -0.4992 -0.2852 0.1486 0.0739 -0.1307 -0.2786 -0.3256 -0.3139 0.4257 -0.0344 -0.2225 -0.2630 0.0704 -0.0465 -0.4025 -0.0202 0.2334 -0.0450 0.0896 -0.2101 -0.2589 -0.1520 -0.1504 -0.1751 0.0958 0.0924 0.0968 0.0907 0.0979 0.0997 0.1028 0.1068 0.1205 0.0883 0.0936 0.0944 0.0938 0.1020 0.0923 0.1213 0.1215 0.1650 0.1760 0.1115 0.1149 0.1433 0.1482 0.1600 0.1618 0.1613
va: 2.1167 1.9925 2.2645 3.6714 3.7259 3.8541 3.9031 3.9166 3.8756 4.1656 3.7393 3.9243 3.9422 3.8325 3.6027 3.9834 3.9648 3.5817 3.8125 3.5290 3.9662 3.9170 3.8858 3.8537 3.9012 1.0254 1.0347 1.0021 1.0056 1.0016 1.0073 1.0001 0.9891 1.0104 1.0089 0.9948 0.9963 0.9982 0.9949 1.0073 1.0093 0.9951 1.0069 1.0001 1.0109 1.0086 1.0051 1.0002 0.9895 0.9898 0.9888
dispcorr: -0.025745944 hartree
energy: -1079.764865174247
dipole: 14.47118 -15.01214 -0.54096 21.09505 -20.27579 0.81926 -11.76426 10.23697 -1.52729
magnitude: 1.81561 au
magnitude: 4.61492 debye
