program: Gaussian 09
title: 000071583
version: EM64L-G09RevD.01
frameworkgroup: C1[X(CHCl3)]
method: RPBEPBE
basis: SDD
operation: Freq
keyword: #pfreq=noraman
keyword: PBEPBE/SDD
title: #p freq=noraman PBEPBE/SDD
converged: NO NO NO NO
title: Mulliken charges:
elementType: Cl Cl Cl C H
charge: 0.085913 0.085824 0.086066 -0.629774 0.371972
chargesum: 0.00000
title: Mulliken charges with hydrogens summed into heavy atoms:
elementType: Cl Cl Cl C
charge: 0.085913 0.085824 0.086066 -0.257802
polarizability: 4.49167982e+01 -1.57489622e-04 4.49072878e+01 -2.99930464e-03 5.22000634e-03 1.96918410e+01
1716.lowfreq: -10.5149 0.0024 0.0034 0.0042 5.2871 10.4545 240.8774 241.9979 334.2992
frequency: 240.8772 241.9969 334.2991 610.3831 670.3291 671.8696 1180.1259 1180.7564 3173.3484
redmass: 25.8940 25.9019 21.7354 7.9011 10.5557 10.5485 1.0623 1.0622 1.0896
irintensity: 0.0521 0.0519 0.3764 9.9968 202.7758 202.7483 18.6234 18.5739 1.9507
temp: 298.150 k
press: 1.00000 atm
elementType: 17 17 17 6 1
symmnumber: 1
zpe: 49668.9 jmol-1
zpe.correction: 0.018918 hartree
zpe.thermalcorrener: 0.023567 hartree
zpe.thermalcorrenthalpy: 0.024511 hartree
zpe.thermalcorrgfe: -0.010538 hartree
zpe.sumelectzpe: -1418.543435 hartree
zpe.sumelectthermal: -1418.538786 hartree
zpe.sumelectthermalent: -1418.537842 hartree
zpe.sumelectthermalfe: -1418.572891 hartree
dipole: -0.0004 0.0010 1.4231
dipole: 1.4231
quadrupole: -44.9711 -44.9704 -41.8759
quadrupole: 0.0002 -0.0005 0.0005
quadrupole: -1.0319 -1.0313 2.0633 0.0002 -0.0005 0.0005
hfenergy: -1418.5623531 hartree
pointgroup: C01 [X(C1H1Cl3)]
dipole: 0.0004222 0.0000634 -0.5598879 debye
dipolederiv: -0.1733883 -0.0360912 0.004255 -0.036225 -0.8021044 0.0745631 0.010299 0.1790559 -0.1145055 -0.6134947 0.2904753 0.0625366 0.2903468 -0.3617649 -0.0410601 0.149986 -0.0983806 -0.1145329 -0.6760213 -0.2543211 -0.0666594 -0.2541516 -0.2991109 -0.0336125 -0.1602365 -0.0807318 -0.1143961 1.52408 -0.0000934 -0.0002465 -0.0000073 1.5241607 0.0001087 -0.0000751 -0.0000921 0.3590532 -0.0611757 0.0000305 0.0001143 0.0000371 -0.0611805 0.0000009 0.0000265 0.0001486 -0.0156187 unknown
polarizability: 44.9101157|-0.0043499|44.9139704|-0.0060158|-0.0002334|19.691841 unknown
InChI: InChI=1S/CHCl3/c2-1(3)4/h1H
charge 0 multiplicity 1
5 atoms
Cl -0.100588 -1.755363 0.14519
Cl -1.469932 0.964907 0.145316
Cl 1.570296 0.790454 0.144896
C  -0.000027 -0.000012 -0.426467
H  0.000151 -0.000085 -1.520035
