program: Orca
programVersion: 5.0.2
elementType: O O O C C C C C C C C C C C C C C C C C C C C C C H H H H H H H H H H H H H H H H H H H H H H H H H H
charge: 0
multiplicity: 1
keywords: wb97x-d3
keywords: def2-TZVPP
keywords: def2/J RIJCOSX
keywords: DEFGRID2
keywords: scfconv7
keywords: smallprint printgap noloewdin
keywords: NOSOSCF
formula: C22H26O3
InChI: InChI=1/C22H26O3/c1-15(2)10-19-20(22(19,3)4)21(23)25-14-17-12-18(24-13-17)11-16-8-6-5-7-9-16/h5-10,12-13,19-20H,11,14H2,1-4H3
51 atoms
O  1.833351 -2.048263 -0.316986
O  2.190427 -0.80879 1.513028
O  -2.431617 -1.104809 -0.969609
C  4.792791 0.140292 0.035092
C  3.67947 1.064639 -0.305587
C  3.482083 -0.438904 -0.470066
C  5.946574 0.005052 -0.929526
C  5.208394 -0.004896 1.478191
C  3.67714 1.941329 -1.503425
C  2.469241 -1.09516 0.368912
C  2.57809 2.282285 -2.18223
C  2.643633 3.18973 -3.371628
C  1.209052 1.783406 -1.830733
C  0.653432 -2.637769 0.255239
C  -0.542199 -1.799611 -0.027936
C  -0.913649 -0.536511 0.542299
C  -1.500945 -2.083978 -0.939819
C  -2.062091 -0.160227 -0.066042
C  -2.96539 1.003508 0.118913
C  -4.22821 0.619134 0.853363
C  -4.177272 0.313903 2.211851
C  -5.447895 0.536233 0.19171
C  -5.323186 -0.062148 2.895831
C  -6.598505 0.157786 0.874136
C  -6.539372 -0.142406 2.227306
H  3.157611 1.467424 0.559471
H  3.510542 -0.799784 -1.491372
H  5.630371 0.06519 -1.970972
H  6.448359 -0.954278 -0.791813
H  6.684887 0.790906 -0.759144
H  5.584841 -1.008806 1.681956
H  4.403807 0.204233 2.178489
H  6.016569 0.696776 1.69229
H  4.634837 2.339226 -1.827326
H  3.665936 3.484114 -3.607761
H  2.21612 2.708315 -4.254786
H  2.059893 4.097929 -3.202476
H  0.847899 1.084591 -2.590352
H  1.166965 1.277494 -0.868039
H  0.492118 2.607253 -1.805752
H  0.78826 -2.812549 1.32256
H  0.556028 -3.605908 -0.232532
H  -0.401129 0.018211 1.311173
H  -1.640798 -2.915347 -1.613363
H  -3.215419 1.445303 -0.84864
H  -2.419638 1.761504 0.682957
H  -3.230683 0.371005 2.737241
H  -5.501739 0.771687 -0.864528
H  -5.268034 -0.292766 3.951944
H  -7.541371 0.098416 0.345883
H  -7.434496 -0.43614 2.759937
elementType: O C H
totalener: -1079.73868641 hartree
nucrepener: 2109.48321694 hartree
electener: -3189.22190335 hartree
oneelecener: -5658.30076650 hartree
twoeener: 2469.07886315 hartree
cpcmener: -0.02868057 hartree
kineticenergy: 1074.86332821 hartree
xcener: -106.462317834208 hartree
chargesum: 0.0000000
charge: -0.293077 -0.507353 -0.288149 0.177332 -0.022213 -0.113995 -0.288614 -0.283829 -0.307450 0.417587 0.001158 -0.230700 -0.238121 0.079877 -0.064455 -0.364134 -0.038969 0.232599 -0.042365 0.032887 -0.195777 -0.197512 -0.164767 -0.158229 -0.174048 0.103853 0.091173 0.092680 0.097916 0.099528 0.100187 0.090348 0.094341 0.124426 0.090149 0.095256 0.097103 0.105471 0.068505 0.102727 0.117785 0.119029 0.162993 0.179819 0.109788 0.117522 0.147047 0.142953 0.160465 0.159660 0.161592
qa: -0.2931 -0.5074 -0.2881 0.1773 -0.0222 -0.1140 -0.2886 -0.2838 -0.3075 0.4176 0.0012 -0.2307 -0.2381 0.0799 -0.0645 -0.3641 -0.0390 0.2326 -0.0424 0.0329 -0.1958 -0.1975 -0.1648 -0.1582 -0.1740 0.1039 0.0912 0.0927 0.0979 0.0995 0.1002 0.0903 0.0943 0.1244 0.0901 0.0953 0.0971 0.1055 0.0685 0.1027 0.1178 0.1190 0.1630 0.1798 0.1098 0.1175 0.1470 0.1430 0.1605 0.1597 0.1616
va: 2.1029 1.9851 2.2674 3.6735 3.8227 3.8279 3.9132 3.8847 3.8961 4.1113 3.7191 3.9299 3.9356 3.8412 3.6524 3.9720 3.9715 3.6071 3.7981 3.6139 3.9305 3.9490 3.9057 3.8889 3.8921 1.0248 1.0354 1.0011 1.0030 0.9994 0.9989 1.0202 1.0008 1.0034 1.0057 0.9958 0.9961 0.9964 1.0146 1.0014 1.0097 0.9976 1.0208 0.9929 1.0109 1.0076 1.0023 1.0040 0.9905 0.9902 0.9891
dispcorr: -0.024361545 hartree
energy: -1079.763047951237
dipole: 19.97407 -19.86205 0.11202 11.76979 -11.62021 0.14958 -7.12229 6.12253 -0.99976
magnitude: 1.01707 au
magnitude: 2.58519 debye
