program: Orca
programVersion: 5.0.2
elementType: O O O C C C C C C C C C C C C C C C C C C C C C C H H H H H H H H H H H H H H H H H H H H H H H H H H
charge: 0
multiplicity: 1
keywords: wb97x-d3
keywords: def2-TZVPP
keywords: def2/J RIJCOSX
keywords: DEFGRID2
keywords: scfconv7
keywords: smallprint printgap noloewdin
keywords: NOSOSCF
formula: C22H26O3
InChI: InChI=1/C22H26O3/c1-15(2)10-19-20(22(19,3)4)21(23)25-14-17-12-18(24-13-17)11-16-8-6-5-7-9-16/h5-10,12-13,19-20H,11,14H2,1-4H3
51 atoms
O  1.794713 -2.021717 -0.287947
O  2.078708 -0.671565 1.475246
O  -2.512985 -1.335679 -1.054203
C  4.720624 0.206658 0.031556
C  3.618904 1.111367 -0.390077
C  3.42634 -0.398414 -0.485857
C  5.906115 0.026846 -0.886121
C  5.089009 0.130483 1.492949
C  3.65691 1.926086 -1.63043
C  2.396024 -1.019635 0.358733
C  2.580072 2.238599 -2.356664
C  2.68555 3.083065 -3.588681
C  1.198404 1.766068 -2.020488
C  0.629105 -2.621209 0.300738
C  -0.595847 -1.859547 -0.062707
C  -1.01143 -0.559029 0.377859
C  -1.546848 -2.272219 -0.932586
C  -2.176601 -0.290333 -0.256017
C  -3.131203 0.8468 -0.173496
C  -4.212598 0.586872 0.848573
C  -5.32049 -0.194622 0.530404
C  -4.095077 1.090889 2.14061
C  -6.289301 -0.468847 1.486157
C  -5.064347 0.821279 3.097441
C  -6.164365 0.038494 2.773231
H  3.070091 1.556878 0.436428
H  3.486016 -0.811189 -1.48597
H  6.406269 -0.92178 -0.683347
H  6.635837 0.824086 -0.732167
H  5.624556 0.032031 -1.939153
H  5.445685 -0.866226 1.758945
H  4.26605 0.384611 2.156556
H  5.899663 0.832586 1.697185
H  4.626228 2.301365 -1.946651
H  3.71607 3.359401 -3.810399
H  2.279803 2.558902 -4.457685
H  2.103523 4.002072 -3.483498
H  0.488876 2.596554 -2.043149
H  0.848407 1.043165 -2.762594
H  1.127464 1.295992 -1.041215
H  0.746826 -2.714035 1.380435
H  0.583595 -3.625494 -0.116722
H  -0.514751 0.088505 1.082164
H  -1.65794 -3.172382 -1.517242
H  -3.574782 1.030462 -1.154844
H  -2.572497 1.743194 0.097361
H  -5.429399 -0.589951 -0.472707
H  -3.238164 1.701802 2.399483
H  -7.144875 -1.078226 1.224689
H  -4.960266 1.224699 4.09654
H  -6.920949 -0.172764 3.517634
elementType: O C H
totalener: -1079.73831422 hartree
nucrepener: 2107.58284513 hartree
electener: -3187.32115935 hartree
oneelecener: -5654.51915232 hartree
twoeener: 2467.19799296 hartree
cpcmener: -0.02864666 hartree
kineticenergy: 1074.85871912 hartree
xcener: -106.461031196234 hartree
chargesum: 0.0000000
charge: -0.293003 -0.508246 -0.285925 0.174209 -0.022675 -0.110179 -0.288972 -0.283909 -0.306776 0.419225 -0.001291 -0.230543 -0.235969 0.080387 -0.065403 -0.359670 -0.042359 0.236135 -0.047593 0.043138 -0.207546 -0.199063 -0.157894 -0.154074 -0.178494 0.103903 0.090864 0.098156 0.099561 0.092591 0.100614 0.090525 0.094200 0.124718 0.090067 0.095326 0.096960 0.102499 0.104461 0.068480 0.117693 0.119069 0.165172 0.179360 0.116131 0.107979 0.142610 0.144163 0.160057 0.160400 0.160932
qa: -0.2930 -0.5082 -0.2859 0.1742 -0.0227 -0.1102 -0.2890 -0.2839 -0.3068 0.4192 -0.0013 -0.2305 -0.2360 0.0804 -0.0654 -0.3597 -0.0424 0.2361 -0.0476 0.0431 -0.2075 -0.1991 -0.1579 -0.1541 -0.1785 0.1039 0.0909 0.0982 0.0996 0.0926 0.1006 0.0905 0.0942 0.1247 0.0901 0.0953 0.0970 0.1025 0.1045 0.0685 0.1177 0.1191 0.1652 0.1794 0.1161 0.1080 0.1426 0.1442 0.1601 0.1604 0.1609
va: 2.1049 1.9839 2.2687 3.6768 3.8243 3.8271 3.9139 3.8852 3.8947 4.1066 3.7182 3.9300 3.9357 3.8387 3.6622 3.9794 3.9713 3.6127 3.7952 3.6061 3.9545 3.9340 3.8962 3.8859 3.8961 1.0246 1.0351 1.0028 0.9994 1.0012 0.9987 1.0200 1.0009 1.0033 1.0057 0.9958 0.9961 1.0014 0.9968 1.0148 1.0102 0.9980 1.0196 0.9928 1.0116 1.0111 1.0104 1.0033 0.9901 0.9897 0.9895
dispcorr: -0.024156699 hartree
energy: -1079.762470922063
dipole: 20.12694 -19.98792 0.13902 11.88616 -11.81426 0.07190 -7.46994 6.44393 -1.02601
magnitude: 1.03788 au
magnitude: 2.63809 debye
