program: Orca
programVersion: 5.0.2
elementType: O O O C C C C C C C C C C C C C C C C C C C C C C H H H H H H H H H H H H H H H H H H H H H H H H H H
charge: 0
multiplicity: 1
keywords: wb97x-d3
keywords: def2-TZVPP
keywords: def2/J RIJCOSX
keywords: DEFGRID2
keywords: scfconv7
keywords: smallprint printgap noloewdin
keywords: NOSOSCF
formula: C22H26O3
InChI: InChI=1/C22H26O3/c1-15(2)10-19-20(22(19,3)4)21(23)25-14-17-12-18(24-13-17)11-16-8-6-5-7-9-16/h5-10,12-13,19-20H,11,14H2,1-4H3
51 atoms
O  1.910086 -2.243635 -0.799824
O  1.945691 -1.713983 1.37371
O  -2.309424 -2.030702 -1.042476
C  3.557434 0.820768 0.507732
C  2.107273 1.138361 0.379352
C  2.66318 -0.124775 -0.270173
C  4.541058 1.587388 -0.344768
C  4.118718 0.446708 1.857436
C  1.601148 2.248754 -0.467604
C  2.162632 -1.418038 0.219005
C  0.571455 2.165997 -1.314791
C  0.134911 3.346753 -2.125987
C  -0.217693 0.911002 -1.537145
C  1.050965 -3.37718 -0.559674
C  -0.355307 -2.904019 -0.447138
C  -1.056948 -2.480988 0.728694
C  -1.171466 -2.608979 -1.486396
C  -2.230735 -1.953153 0.312066
C  -3.308557 -1.218122 1.021719
C  -3.095908 0.274726 0.903344
C  -3.882756 1.05024 0.060053
C  -2.060833 0.887344 1.6080
C  -3.644752 2.413798 -0.074557
C  -1.820024 2.246036 1.47571
C  -2.613055 3.015425 0.631408
H  1.524232 0.942008 1.277911
H  2.774828 -0.073608 -1.346921
H  4.812987 2.530017 0.134343
H  4.145392 1.818299 -1.333909
H  5.457519 1.010643 -0.481721
H  4.94877 -0.254874 1.757869
H  3.381488 0.006725 2.523842
H  4.505742 1.342603 2.346657
H  2.111064 3.203191 -0.364272
H  0.154051 3.115001 -3.194084
H  -0.896607 3.621355 -1.889418
H  0.765177 4.219771 -1.958342
H  -0.088448 0.179418 -0.742773
H  -1.283401 1.13721 -1.612928
H  0.065124 0.436075 -2.480788
H  1.372374 -3.935511 0.319414
H  1.185774 -4.013396 -1.432295
H  -0.724184 -2.551261 1.751681
H  -1.077049 -2.74394 -2.55281
H  -3.289369 -1.516624 2.071028
H  -4.288852 -1.492908 0.626979
H  -4.689468 0.587932 -0.496243
H  -1.433537 0.293778 2.263562
H  -4.26697 3.004922 -0.734174
H  -1.011959 2.705669 2.030308
H  -2.42673 4.076366 0.526405
elementType: O C H
totalener: -1079.73739597 hartree
nucrepener: 2282.29606931 hartree
electener: -3362.03346527 hartree
oneelecener: -6004.35390962 hartree
twoeener: 2642.32044435 hartree
cpcmener: -0.02783799 hartree
kineticenergy: 1074.85885359 hartree
xcener: -106.464924019452 hartree
chargesum: -0.0000000
charge: -0.293903 -0.499743 -0.278900 0.160940 0.002848 -0.094450 -0.287067 -0.290009 -0.305861 0.385343 -0.017000 -0.225561 -0.211867 0.078593 -0.071803 -0.292940 -0.052129 0.187040 -0.045653 0.056338 -0.199727 -0.213470 -0.128160 -0.142479 -0.210296 0.099833 0.093632 0.099509 0.093089 0.098650 0.100488 0.090380 0.094362 0.121897 0.101695 0.091463 0.091017 0.019769 0.102556 0.125597 0.118066 0.123953 0.160556 0.177537 0.116349 0.107344 0.140816 0.140812 0.158242 0.159072 0.163232
qa: -0.2939 -0.4997 -0.2789 0.1609 0.0028 -0.0945 -0.2871 -0.2900 -0.3059 0.3853 -0.0170 -0.2256 -0.2119 0.0786 -0.0718 -0.2929 -0.0521 0.1870 -0.0457 0.0563 -0.1997 -0.2135 -0.1282 -0.1425 -0.2103 0.0998 0.0936 0.0995 0.0931 0.0987 0.1005 0.0904 0.0944 0.1219 0.1017 0.0915 0.0910 0.0198 0.1026 0.1256 0.1181 0.1240 0.1606 0.1775 0.1163 0.1073 0.1408 0.1408 0.1582 0.1591 0.1632
va: 2.1024 1.9936 2.2521 3.7195 3.7770 3.8174 3.9055 3.8820 3.8529 4.1565 3.7211 3.9248 3.9111 3.8436 3.6370 3.9598 3.9208 3.6445 3.8154 3.5603 3.9408 3.8665 3.8446 3.8160 3.8521 1.0228 1.0317 1.0004 1.0025 1.0027 0.9988 1.0211 1.0005 1.0050 0.9961 0.9971 1.0066 1.0144 1.0011 1.0034 1.0085 0.9961 1.0150 0.9931 1.0079 1.0139 1.0045 1.0065 0.9898 0.9911 0.9889
dispcorr: -0.031393933 hartree
energy: -1079.768789900181
dipole: 10.94356 -11.12294 -0.17937 16.49296 -16.13522 0.35775 -2.98714 2.08778 -0.89935
magnitude: 0.98438 au
magnitude: 2.50208 debye
