program: Orca
programVersion: 5.0.2
elementType: O O O C C C C C C C C C C C C C C C C C C C C C C H H H H H H H H H H H H H H H H H H H H H H H H H H
charge: 0
multiplicity: 1
keywords: wb97x-d3
keywords: def2-TZVPP
keywords: def2/J RIJCOSX
keywords: DEFGRID2
keywords: scfconv7
keywords: smallprint printgap noloewdin
keywords: NOSOSCF
formula: C22H26O3
InChI: InChI=1/C22H26O3/c1-15(2)10-19-20(22(19,3)4)21(23)25-14-17-12-18(24-13-17)11-16-8-6-5-7-9-16/h5-10,12-13,19-20H,11,14H2,1-4H3
51 atoms
O  1.479644 -1.529576 0.205605
O  1.376678 -0.955959 -1.954249
O  -2.825821 -1.75641 -0.631254
C  2.162609 1.858707 -0.779959
C  3.34004 1.219984 -1.428405
C  2.548285 0.434409 -0.398583
C  2.391143 2.889436 0.299174
C  0.924688 2.127501 -1.59945
C  4.734642 1.642944 -1.138373
C  1.749651 -0.726364 -0.823805
C  5.804557 0.84653 -1.205324
C  7.18299 1.366227 -0.934526
C  5.728584 -0.607798 -1.552474
C  0.671743 -2.694126 -0.04348
C  -0.779178 -2.364715 -0.018685
C  -1.631983 -2.356751 1.132821
C  -1.563857 -1.991054 -1.0574
C  -2.860972 -1.985581 0.707663
C  -4.148061 -1.763907 1.412876
C  -4.475097 -0.297481 1.570394
C  -5.544094 0.276376 0.892066
C  -3.697588 0.505519 2.402585
C  -5.835764 1.627214 1.042847
C  -3.986994 1.852589 2.556846
C  -5.058317 2.418857 1.87535
H  3.164225 0.887675 -2.448606
H  2.998583 0.335467 0.582451
H  1.51498 2.963754 0.945511
H  2.561168 3.874286 -0.140452
H  3.247552 2.653808 0.930465
H  0.023596 2.047745 -0.988509
H  0.817248 1.458297 -2.449842
H  0.964842 3.145183 -1.992323
H  4.885128 2.687673 -0.880721
H  7.653372 0.818403 -0.114001
H  7.82992 1.231612 -1.805035
H  7.179958 2.425001 -0.676437
H  6.159737 -1.217211 -0.754178
H  4.712668 -0.95706 -1.729526
H  6.316223 -0.819543 -2.449459
H  0.917477 -3.37752 0.767156
H  0.963798 -3.168085 -0.980285
H  -1.356462 -2.606849 2.145506
H  -1.378883 -1.865383 -2.112402
H  -4.07055 -2.233694 2.394874
H  -4.959873 -2.269476 0.88465
H  -6.157146 -0.337245 0.242653
H  -2.859935 0.070854 2.936254
H  -6.673128 2.058754 0.509783
H  -3.377312 2.462261 3.211248
H  -5.28638 3.469705 1.997393
elementType: O C H
totalener: -1079.73984212 hartree
nucrepener: 2084.95803558 hartree
electener: -3164.69787770 hartree
oneelecener: -5609.48397975 hartree
twoeener: 2444.78610206 hartree
cpcmener: -0.02896343 hartree
kineticenergy: 1074.85449546 hartree
xcener: -106.460104909277 hartree
chargesum: -0.0000000
charge: -0.291607 -0.509295 -0.285604 0.155060 -0.027259 -0.106012 -0.290933 -0.280291 -0.291603 0.419052 -0.015162 -0.228296 -0.244147 0.094595 -0.087189 -0.327030 -0.018151 0.204877 -0.054617 0.027788 -0.193124 -0.192740 -0.155821 -0.162900 -0.175435 0.101769 0.094063 0.098713 0.099444 0.093560 0.100493 0.091620 0.096782 0.124786 0.094738 0.095946 0.089707 0.097971 0.080651 0.101376 0.120385 0.121176 0.165299 0.171017 0.119417 0.107258 0.142292 0.146411 0.160015 0.159816 0.161138
qa: -0.2916 -0.5093 -0.2856 0.1551 -0.0273 -0.1060 -0.2909 -0.2803 -0.2916 0.4191 -0.0152 -0.2283 -0.2441 0.0946 -0.0872 -0.3270 -0.0182 0.2049 -0.0546 0.0278 -0.1931 -0.1927 -0.1558 -0.1629 -0.1754 0.1018 0.0941 0.0987 0.0994 0.0936 0.1005 0.0916 0.0968 0.1248 0.0947 0.0959 0.0897 0.0980 0.0807 0.1014 0.1204 0.1212 0.1653 0.1710 0.1194 0.1073 0.1423 0.1464 0.1600 0.1598 0.1611
va: 2.1180 1.9850 2.2688 3.6968 3.8260 3.8256 3.9119 3.8888 3.8824 4.1192 3.7043 3.9290 3.9384 3.7947 3.6318 4.0108 3.9421 3.6190 3.8156 3.6135 3.9436 3.9301 3.8858 3.9043 3.8937 1.0262 1.0317 1.0026 0.9995 1.0014 0.9992 1.0177 1.0017 1.0024 0.9966 0.9958 1.0064 0.9986 1.0148 0.9988 0.9961 1.0116 1.0050 1.0061 1.0050 1.0110 1.0035 1.0026 0.9900 0.9908 0.9895
dispcorr: -0.022736929 hartree
energy: -1079.762579051214
dipole: 24.31637 -23.89859 0.41778 13.01616 -13.07959 -0.06342 -1.51965 2.77627 1.25662
magnitude: 1.32576 au
magnitude: 3.36982 debye
