program: Orca
programVersion: 5.0.2
elementType: O O O C C C C C C C C C C C C C C C C C C C C C C H H H H H H H H H H H H H H H H H H H H H H H H H H
charge: 0
multiplicity: 1
keywords: wb97x-d3
keywords: def2-TZVPP
keywords: def2/J RIJCOSX
keywords: DEFGRID2
keywords: scfconv7
keywords: smallprint printgap noloewdin
keywords: NOSOSCF
formula: C22H26O3
InChI: InChI=1/C22H26O3/c1-15(2)10-19-20(22(19,3)4)21(23)25-14-17-12-18(24-13-17)11-16-8-6-5-7-9-16/h5-10,12-13,19-20H,11,14H2,1-4H3
51 atoms
O  1.344191 -1.432322 -1.163449
O  2.122441 -1.737011 0.909631
O  -2.15398 -2.534141 1.217396
C  1.518207 1.56103 -0.184738
C  2.407455 1.243425 -1.340941
C  2.455936 0.361968 -0.112859
C  1.870472 2.71194 0.725224
C  0.029432 1.350763 -0.322435
C  3.587755 2.080326 -1.684809
C  1.963321 -1.025979 -0.059992
C  4.743767 1.608458 -2.15853
C  5.884775 2.520467 -2.49062
C  5.006083 0.152932 -2.392445
C  0.654212 -2.696411 -1.12573
C  -0.634563 -2.555285 -0.400493
C  -1.825854 -1.923795 -0.886014
C  -0.898072 -2.903294 0.880062
C  -2.713976 -1.933681 0.133769
C  -4.06769 -1.346137 0.300134
C  -3.995976 -0.052034 1.076922
C  -4.303683 -0.009156 2.432255
C  -3.565576 1.113823 0.447622
C  -4.186118 1.177176 3.146603
C  -3.448535 2.299568 1.157323
C  -3.758259 2.334405 2.511664
H  1.894385 0.805701 -2.193313
H  3.306872 0.508016 0.543466
H  1.484222 3.650788 0.323087
H  2.945937 2.824329 0.862128
H  1.424912 2.568031 1.711146
H  -0.448638 2.288415 -0.613978
H  -0.413088 1.039786 0.626321
H  -0.23131 0.609641 -1.075538
H  3.48152 3.153819 -1.555032
H  6.775023 2.255493 -1.914524
H  6.163075 2.433794 -3.543884
H  5.649375 3.564943 -2.287868
H  4.143141 -0.479784 -2.193482
H  5.314511 -0.018353 -3.426762
H  5.831046 -0.19613 -1.765854
H  1.285107 -3.468953 -0.686648
H  0.490658 -2.947959 -2.171713
H  -1.988972 -1.507466 -1.867842
H  -0.319394 -3.405601 1.639081
H  -4.73258 -2.052141 0.80254
H  -4.481419 -1.165156 -0.692791
H  -4.640876 -0.908103 2.934419
H  -3.314917 1.091163 -0.606943
H  -4.429505 1.196042 4.201049
H  -3.114456 3.19725 0.653078
H  -3.667075 3.258583 3.067254
elementType: O C H
totalener: -1079.73753681 hartree
nucrepener: 2168.06255130 hartree
electener: -3247.80008811 hartree
oneelecener: -5775.44093598 hartree
twoeener: 2527.64084786 hartree
cpcmener: -0.03101113 hartree
kineticenergy: 1074.86828095 hartree
xcener: -106.464237206925 hartree
chargesum: 0.0000000
charge: -0.281694 -0.499644 -0.284910 0.192073 0.019278 -0.143541 -0.295457 -0.329820 -0.322967 0.424354 -0.012906 -0.230446 -0.239544 0.070524 -0.046198 -0.404996 -0.020496 0.236174 -0.047875 0.084953 -0.207521 -0.255629 -0.153001 -0.152101 -0.174638 0.106682 0.097006 0.098648 0.094209 0.098451 0.103190 0.108597 0.099177 0.124336 0.094969 0.096414 0.090106 0.077732 0.101217 0.099439 0.121070 0.120718 0.165100 0.175887 0.111034 0.116136 0.143557 0.149211 0.160100 0.161901 0.161142
qa: -0.2817 -0.4996 -0.2849 0.1921 0.0193 -0.1435 -0.2955 -0.3298 -0.3230 0.4244 -0.0129 -0.2304 -0.2395 0.0705 -0.0462 -0.4050 -0.0205 0.2362 -0.0479 0.0850 -0.2075 -0.2556 -0.1530 -0.1521 -0.1746 0.1067 0.0970 0.0986 0.0942 0.0985 0.1032 0.1086 0.0992 0.1243 0.0950 0.0964 0.0901 0.0777 0.1012 0.0994 0.1211 0.1207 0.1651 0.1759 0.1110 0.1161 0.1436 0.1492 0.1601 0.1619 0.1611
va: 2.0949 1.9929 2.2651 3.6829 3.7764 3.8505 3.9018 3.8976 3.8875 4.1156 3.7052 3.9297 3.9313 3.8326 3.6008 3.9845 3.9650 3.5784 3.8126 3.5352 3.9641 3.9166 3.8863 3.8585 3.9009 1.0206 1.0278 0.9999 1.0019 1.0026 1.0009 0.9888 1.0067 1.0027 0.9965 0.9960 1.0061 1.0200 0.9997 0.9985 1.0092 0.9953 1.0070 1.0009 1.0110 1.0080 1.0045 0.9992 0.9895 0.9899 0.9889
dispcorr: -0.026550784 hartree
energy: -1079.764087596436
dipole: 17.27471 -17.69702 -0.42232 17.07304 -16.38639 0.68665 -8.78689 7.39751 -1.38938
magnitude: 1.60631 au
magnitude: 4.08290 debye
