program: Orca
programVersion: 5.0.2
elementType: O O O C C C C C C C C C C C C C C C C C C C C C C H H H H H H H H H H H H H H H H H H H H H H H H H H
charge: 0
multiplicity: 1
keywords: wb97x-d3
keywords: def2-TZVPP
keywords: def2/J RIJCOSX
keywords: DEFGRID2
keywords: scfconv7
keywords: smallprint printgap noloewdin
keywords: NOSOSCF
formula: C22H26O3
InChI: InChI=1/C22H26O3/c1-15(2)10-19-20(22(19,3)4)21(23)25-14-17-12-18(24-13-17)11-16-8-6-5-7-9-16/h5-10,12-13,19-20H,11,14H2,1-4H3
51 atoms
O  1.295213 -1.423623 -1.230801
O  2.211304 -1.704673 0.788642
O  -2.020162 -2.585891 1.371552
C  1.45751 1.576359 -0.270913
C  2.284646 1.278199 -1.476688
C  2.426279 0.399849 -0.252769
C  1.834108 2.73512 0.61961
C  -0.03184 1.334957 -0.325147
C  3.420459 2.142392 -1.893963
C  1.973602 -1.000069 -0.169962
C  4.532671 1.701783 -2.487765
C  5.625183 2.640117 -2.899676
C  4.786734 0.257396 -2.79031
C  0.635576 -2.701754 -1.146818
C  -0.606334 -2.583316 -0.340052
C  -1.834455 -1.966952 -0.746949
C  -0.782686 -2.93652 0.954092
C  -2.65495 -1.989298 0.327533
C  -4.001291 -1.416044 0.58056
C  -3.893047 -0.11175 1.335973
C  -3.538777 1.054853 0.661834
C  -4.09087 -0.058986 2.711583
C  -3.386291 2.250552 1.348114
C  -3.937775 1.137313 3.402389
C  -3.584162 2.294854 2.72305
H  1.732339 0.825305 -2.295944
H  3.309767 0.569186 0.352922
H  2.912799 2.86899 0.700848
H  1.443459 2.583005 1.627489
H  1.408545 3.666132 0.239244
H  -0.543515 2.263072 -0.59022
H  -0.414747 1.016877 0.646763
H  -0.319983 0.588217 -1.062868
H  3.315643 3.209725 -1.719548
H  6.568833 2.376646 -2.414888
H  5.806005 2.583408 -3.976057
H  5.395065 3.675625 -2.649969
H  4.944902 0.112545 -3.86243
H  5.70091 -0.084648 -2.297585
H  3.974212 -0.398438 -2.482241
H  1.309128 -3.460558 -0.748898
H  0.410089 -2.959248 -2.179794
H  -2.065961 -1.55084 -1.715164
H  -0.150494 -3.433179 1.67327
H  -4.621074 -2.124085 1.135098
H  -4.484792 -1.251267 -0.383162
H  -3.374632 1.024826 -0.409517
H  -4.368865 -0.958358 3.248409
H  -3.111499 3.148442 0.809308
H  -4.094703 1.163919 4.473067
H  -3.464262 3.226751 3.260187
elementType: O C H
totalener: -1079.73747220 hartree
nucrepener: 2169.67299299 hartree
electener: -3249.41046519 hartree
oneelecener: -5778.66657842 hartree
twoeener: 2529.25611323 hartree
cpcmener: -0.03113354 hartree
kineticenergy: 1074.85855668 hartree
xcener: -106.462478508729 hartree
chargesum: -0.0000000
charge: -0.281705 -0.500032 -0.284426 0.193075 0.012540 -0.139479 -0.297155 -0.327095 -0.317570 0.424953 -0.014951 -0.230034 -0.239502 0.071129 -0.045154 -0.406251 -0.021192 0.236039 -0.046495 0.086041 -0.256754 -0.208120 -0.151919 -0.152517 -0.174979 0.107338 0.095549 0.094542 0.098505 0.098877 0.102909 0.107375 0.099458 0.124416 0.095315 0.095977 0.089851 0.101290 0.097816 0.077600 0.120630 0.120702 0.165484 0.176013 0.110670 0.115435 0.148709 0.143749 0.162095 0.160146 0.161104
qa: -0.2817 -0.5000 -0.2844 0.1931 0.0125 -0.1395 -0.2972 -0.3271 -0.3176 0.4250 -0.0150 -0.2300 -0.2395 0.0711 -0.0452 -0.4063 -0.0212 0.2360 -0.0465 0.0860 -0.2568 -0.2081 -0.1519 -0.1525 -0.1750 0.1073 0.0955 0.0945 0.0985 0.0989 0.1029 0.1074 0.0995 0.1244 0.0953 0.0960 0.0899 0.1013 0.0978 0.0776 0.1206 0.1207 0.1655 0.1760 0.1107 0.1154 0.1487 0.1437 0.1621 0.1601 0.1611
va: 2.0955 1.9925 2.2650 3.6819 3.7835 3.8470 3.9025 3.8964 3.8841 4.1166 3.7075 3.9295 3.9329 3.8340 3.6015 3.9841 3.9656 3.5789 3.8132 3.5326 3.9158 3.9642 3.8554 3.8856 3.9015 1.0205 1.0287 1.0017 1.0026 0.9998 1.0007 0.9888 1.0066 1.0026 0.9965 0.9958 1.0062 0.9992 0.9988 1.0200 1.0092 0.9951 1.0068 1.0006 1.0113 1.0082 0.9995 1.0047 0.9899 0.9894 0.9889
dispcorr: -0.026603440 hartree
energy: -1079.764075642025
dipole: 16.12349 -16.66087 -0.53738 17.44650 -16.76458 0.68191 -10.13364 8.75738 -1.37626
magnitude: 1.62723 au
magnitude: 4.13609 debye
