program: Orca
programVersion: 5.0.2
elementType: O O O C C C C C C C C C C C C C C C C C C C C C C H H H H H H H H H H H H H H H H H H H H H H H H H H
charge: 0
multiplicity: 1
keywords: wb97x-d3
keywords: def2-TZVPP
keywords: def2/J RIJCOSX
keywords: DEFGRID2
keywords: scfconv7
keywords: smallprint printgap noloewdin
keywords: NOSOSCF
formula: C22H26O3
InChI: InChI=1/C22H26O3/c1-15(2)10-19-20(22(19,3)4)21(23)25-14-17-12-18(24-13-17)11-16-8-6-5-7-9-16/h5-10,12-13,19-20H,11,14H2,1-4H3
51 atoms
O  1.438035 -2.021632 -0.983732
O  0.593829 -0.094932 -1.744152
O  -1.645422 -1.591029 1.829923
C  3.037853 1.000411 -0.040515
C  3.303884 1.140737 -1.509042
C  2.859059 -0.194716 -0.966616
C  4.210109 0.922968 0.905286
C  1.838165 1.697006 0.551208
C  4.676754 1.27223 -2.056277
C  1.520316 -0.720979 -1.282909
C  5.226321 2.410322 -2.488855
C  6.614707 2.435854 -3.052076
C  4.531243 3.736574 -2.456724
C  0.181345 -2.669293 -1.166227
C  -0.771671 -2.33109 -0.073056
C  -2.170422 -2.634497 -0.050489
C  -0.509509 -1.701485 1.094753
C  -2.649412 -2.164921 1.125619
C  -4.010302 -2.129753 1.716058
C  -4.566313 -0.727442 1.795874
C  -4.801064 0.001399 0.63154
C  -4.852478 -0.140451 3.022924
C  -5.31871 1.286259 0.693651
C  -5.372592 1.147159 3.088835
C  -5.608072 1.863754 1.924855
H  2.533221 1.686152 -2.045804
H  3.626449 -0.955567 -0.869927
H  3.918678 0.445118 1.842334
H  4.571218 1.925685 1.143632
H  5.046498 0.360229 0.492076
H  1.423959 1.128117 1.386338
H  1.041246 1.866467 -0.169727
H  2.137953 2.672972 0.937736
H  5.271652 0.364562 -2.104643
H  7.078049 1.449421 -3.048992
H  6.612524 2.804541 -4.081071
H  7.256492 3.113928 -2.483967
H  4.423775 4.143557 -3.46553
H  3.542194 3.697309 -2.003468
H  5.124439 4.462915 -1.89548
H  0.408559 -3.735725 -1.165569
H  -0.244862 -2.431642 -2.143238
H  -2.741646 -3.132217 -0.818561
H  0.387591 -1.291163 1.53177
H  -4.002595 -2.580204 2.711907
H  -4.656136 -2.752881 1.09461
H  -4.578522 -0.442245 -0.332336
H  -4.671407 -0.695214 3.935892
H  -5.499335 1.838089 -0.219885
H  -5.592829 1.588798 4.052223
H  -6.013664 2.865873 1.973974
elementType: O C H
totalener: -1079.73993172 hartree
nucrepener: 2067.42949561 hartree
electener: -3147.16942733 hartree
oneelecener: -5574.46806348 hartree
twoeener: 2427.29863614 hartree
cpcmener: -0.03315027 hartree
kineticenergy: 1074.85481561 hartree
xcener: -106.462970439182 hartree
chargesum: -0.0000000
charge: -0.295233 -0.489492 -0.292494 0.156964 -0.007740 -0.119857 -0.268862 -0.298329 -0.273037 0.393820 -0.032322 -0.229655 -0.251796 0.108239 -0.028875 -0.353892 -0.064354 0.212815 -0.048795 0.016240 -0.190876 -0.185106 -0.164545 -0.159011 -0.172928 0.097631 0.093794 0.099315 0.096757 0.091906 0.097225 0.095077 0.100735 0.123479 0.089690 0.094891 0.094398 0.099371 0.088459 0.096380 0.124275 0.117387 0.164180 0.178697 0.106487 0.116768 0.147248 0.143066 0.160497 0.160207 0.161200
qa: -0.2952 -0.4895 -0.2925 0.1570 -0.0077 -0.1199 -0.2689 -0.2983 -0.2730 0.3938 -0.0323 -0.2297 -0.2518 0.1082 -0.0289 -0.3539 -0.0644 0.2128 -0.0488 0.0162 -0.1909 -0.1851 -0.1645 -0.1590 -0.1729 0.0976 0.0938 0.0993 0.0968 0.0919 0.0972 0.0951 0.1007 0.1235 0.0897 0.0949 0.0944 0.0994 0.0885 0.0964 0.1243 0.1174 0.1642 0.1787 0.1065 0.1168 0.1472 0.1431 0.1605 0.1602 0.1612
va: 2.1181 2.0012 2.2580 3.6559 3.7942 3.8764 3.9036 3.8958 3.8714 4.1783 3.7003 3.9266 3.9420 3.8122 3.6132 4.0014 3.9486 3.6115 3.8179 3.6287 3.9265 3.9372 3.9035 3.8886 3.8922 1.0256 1.0379 1.0028 1.0025 1.0022 1.0027 1.0159 1.0027 1.0067 1.0077 0.9950 0.9963 0.9977 1.0078 0.9974 0.9916 1.0106 1.0047 0.9935 1.0088 1.0054 1.0030 1.0031 0.9907 0.9901 0.9894
dispcorr: -0.022929872 hartree
energy: -1079.762861593244
dipole: 24.69029 -24.03803 0.65225 17.11332 -17.61948 -0.50616 -5.16919 5.41273 0.24354
magnitude: 0.86078 au
magnitude: 2.18794 debye
