program: Orca
programVersion: 5.0.2
elementType: O O O C C C C C C C C C C C C C C C C C C C C C C H H H H H H H H H H H H H H H H H H H H H H H H H H
charge: 0
multiplicity: 1
keywords: wb97x-d3
keywords: def2-TZVPP
keywords: def2/J RIJCOSX
keywords: DEFGRID2
keywords: scfconv7
keywords: smallprint printgap noloewdin
keywords: NOSOSCF
formula: C22H26O3
InChI: InChI=1/C22H26O3/c1-15(2)10-19-20(22(19,3)4)21(23)25-14-17-12-18(24-13-17)11-16-8-6-5-7-9-16/h5-10,12-13,19-20H,11,14H2,1-4H3
51 atoms
O  1.542526 -2.087406 -0.787056
O  0.678077 -0.237353 -1.696487
O  -1.763006 -1.663741 1.779534
C  2.951694 1.054177 0.085176
C  3.309181 1.1200 -1.367868
C  2.887976 -0.201611 -0.774613
C  4.060305 1.09138 1.107146
C  1.685635 1.724398 0.558014
C  4.708269 1.28498 -1.835464
C  1.595718 -0.801643 -1.145859
C  5.242327 2.433609 -2.259277
C  6.656108 2.498688 -2.750187
C  4.498245 3.732873 -2.287882
C  0.324549 -2.792652 -1.022873
C  -0.723217 -2.424013 -0.031008
C  -2.127382 -2.671631 -0.157874
C  -0.560802 -1.813105 1.16422
C  -2.709648 -2.192555 0.965839
C  -4.123721 -2.107879 1.406453
C  -4.614201 -0.68229 1.504138
C  -5.101348 -0.175021 2.70314
C  -4.585732 0.149148 0.385688
C  -5.552932 1.137077 2.787218
C  -5.033927 1.458591 0.466248
C  -5.518349 1.958107 1.669768
H  2.553765 1.594817 -1.987546
H  3.679413 -0.917773 -0.580701
H  3.728576 0.65626 2.051747
H  4.357431 2.123979 1.304301
H  4.948367 0.548427 0.784157
H  1.237143 1.175649 1.389402
H  0.93379 1.826627 -0.221798
H  1.91837 2.728658 0.917032
H  5.333253 0.396443 -1.834052
H  7.150739 1.528382 -2.709133
H  6.695429 2.853482 -3.783364
H  7.245195 3.205136 -2.159951
H  5.042222 4.495226 -1.724571
H  4.412653 4.110399 -3.310226
H  3.495123 3.665679 -1.869705
H  0.588765 -3.847211 -0.937275
H  -0.031898 -2.631415 -2.042395
H  -2.634599 -3.137903 -0.988056
H  0.299296 -1.436605 1.695733
H  -4.252532 -2.607513 2.370204
H  -4.726481 -2.66308 0.684853
H  -5.129325 -0.810489 3.580358
H  -4.207123 -0.231145 -0.556305
H  -5.929058 1.516757 3.728458
H  -5.004422 2.09169 -0.411204
H  -5.865369 2.981162 1.733596
elementType: O C H
totalener: -1079.73977550 hartree
nucrepener: 2072.73377266 hartree
electener: -3152.47354817 hartree
oneelecener: -5585.13074595 hartree
twoeener: 2432.65719779 hartree
cpcmener: -0.03277828 hartree
kineticenergy: 1074.85211985 hartree
xcener: -106.462179814534 hartree
chargesum: -0.0000000
charge: -0.295145 -0.491651 -0.293000 0.152855 -0.009850 -0.115573 -0.270928 -0.298486 -0.270553 0.397134 -0.033193 -0.229971 -0.251617 0.113193 -0.030104 -0.352285 -0.064869 0.210148 -0.044347 0.008891 -0.182713 -0.188182 -0.157130 -0.164330 -0.172616 0.098375 0.093893 0.099229 0.096890 0.092587 0.097590 0.095054 0.100239 0.123722 0.089705 0.094856 0.094479 0.096359 0.100311 0.087976 0.122579 0.117322 0.163732 0.177685 0.105421 0.116070 0.143106 0.146626 0.159128 0.160606 0.160784
qa: -0.2951 -0.4917 -0.2930 0.1529 -0.0099 -0.1156 -0.2709 -0.2985 -0.2706 0.3971 -0.0332 -0.2300 -0.2516 0.1132 -0.0301 -0.3523 -0.0649 0.2101 -0.0443 0.0089 -0.1827 -0.1882 -0.1571 -0.1643 -0.1726 0.0984 0.0939 0.0992 0.0969 0.0926 0.0976 0.0951 0.1002 0.1237 0.0897 0.0949 0.0945 0.0964 0.1003 0.0880 0.1226 0.1173 0.1637 0.1777 0.1054 0.1161 0.1431 0.1466 0.1591 0.1606 0.1608
va: 2.1199 1.9993 2.2561 3.6558 3.7958 3.8721 3.9046 3.8956 3.8674 4.1792 3.7002 3.9268 3.9411 3.8071 3.6080 3.9996 3.9475 3.6134 3.8201 3.6418 3.9338 3.9227 3.8896 3.9005 3.8921 1.0256 1.0372 1.0031 1.0021 1.0019 1.0024 1.0162 1.0024 1.0065 1.0076 0.9949 0.9964 0.9976 0.9978 1.0077 0.9915 1.0111 1.0049 0.9950 1.0085 1.0051 1.0026 1.0037 0.9904 0.9907 0.9896
dispcorr: -0.023012389 hartree
energy: -1079.762787891200
dipole: 24.20751 -23.56392 0.64359 17.89889 -18.32668 -0.42779 -4.43199 4.70800 0.27601
magnitude: 0.82060 au
magnitude: 2.08580 debye
