program: Orca
programVersion: 5.0.2
elementType: O O O C C C C C C C C C C C C C C C C C C C C C C H H H H H H H H H H H H H H H H H H H H H H H H H H
charge: 0
multiplicity: 1
keywords: wb97x-d3
keywords: def2-TZVPP
keywords: def2/J RIJCOSX
keywords: DEFGRID2
keywords: scfconv7
keywords: smallprint printgap noloewdin
keywords: NOSOSCF
formula: C22H26O3
InChI: InChI=1/C22H26O3/c1-15(2)10-19-20(22(19,3)4)21(23)25-14-17-12-18(24-13-17)11-16-8-6-5-7-9-16/h5-10,12-13,19-20H,11,14H2,1-4H3
51 atoms
O  1.332303 -1.929642 -0.756761
O  2.170398 -1.21249 1.189156
O  -2.234192 -1.769424 1.781267
C  4.164039 0.20635 -0.822183
C  3.243088 1.193096 -0.172015
C  2.6597 -0.030447 -0.832081
C  4.778894 0.556052 -2.154458
C  5.069668 -0.625076 0.050578
C  2.982011 2.534096 -0.752325
C  2.04773 -1.090039 -0.009835
C  3.587913 3.659061 -0.362535
C  3.25628 4.98087 -0.984434
C  4.637701 3.70596 0.704616
C  0.66211 -3.018211 -0.094142
C  -0.656641 -2.601581 0.457804
C  -1.930542 -2.741847 -0.182654
C  -0.909527 -2.00538 1.64791
C  -2.85316 -2.227019 0.662245
C  -4.324518 -2.050422 0.56951
C  -4.711947 -0.613309 0.312653
C  -5.207158 0.19074 1.333336
C  -4.558351 -0.066456 -0.959619
C  -5.5500 1.515113 1.087239
C  -4.901226 1.253865 -1.209019
C  -5.399631 2.049916 -0.184252
H  3.251916 1.15154 0.913469
H  2.188292 0.116928 -1.798121
H  4.093258 1.10063 -2.802814
H  5.090588 -0.346629 -2.682902
H  5.664977 1.178112 -2.011603
H  5.266849 -1.599279 -0.401284
H  4.671354 -0.790268 1.049271
H  6.029455 -0.117652 0.165246
H  2.244868 2.591953 -1.548161
H  2.904397 5.690413 -0.231111
H  4.141266 5.43117 -1.441233
H  2.486898 4.894555 -1.751338
H  4.871123 2.729342 1.1257
H  5.565434 4.125303 0.307003
H  4.330906 4.361721 1.523401
H  1.305011 -3.447321 0.673769
H  0.523377 -3.768611 -0.86985
H  -2.125363 -3.183599 -1.147553
H  -0.282549 -1.7074 2.472921
H  -4.804528 -2.4074 1.484007
H  -4.683168 -2.682629 -0.244173
H  -5.333363 -0.22183 2.327279
H  -4.171633 -0.68293 -1.763099
H  -5.937961 2.127989 1.890623
H  -4.783957 1.661178 -2.20501
H  -5.672371 3.079054 -0.378488
elementType: O C H
totalener: -1079.73981063 hartree
nucrepener: 2057.32356471 hartree
electener: -3137.06337535 hartree
oneelecener: -5554.29990769 hartree
twoeener: 2417.23653234 hartree
cpcmener: -0.02975476 hartree
kineticenergy: 1074.85519924 hartree
xcener: -106.459535534278 hartree
chargesum: 0.0000000
charge: -0.290817 -0.507118 -0.285716 0.138129 -0.008039 -0.122659 -0.270969 -0.297393 -0.266657 0.432641 -0.036338 -0.231009 -0.250259 0.095143 -0.085237 -0.333208 -0.016699 0.201534 -0.057171 0.040779 -0.196871 -0.197122 -0.157827 -0.162176 -0.176089 0.095433 0.093409 0.092379 0.099978 0.096857 0.103110 0.092609 0.097540 0.124430 0.095095 0.094496 0.090287 0.087115 0.096960 0.100010 0.122039 0.121991 0.165539 0.169870 0.111233 0.118545 0.143245 0.146457 0.160642 0.160885 0.160992
qa: -0.2908 -0.5071 -0.2857 0.1381 -0.0080 -0.1227 -0.2710 -0.2974 -0.2667 0.4326 -0.0363 -0.2310 -0.2503 0.0951 -0.0852 -0.3332 -0.0167 0.2015 -0.0572 0.0408 -0.1969 -0.1971 -0.1578 -0.1622 -0.1761 0.0954 0.0934 0.0924 0.1000 0.0969 0.1031 0.0926 0.0975 0.1244 0.0951 0.0945 0.0903 0.0871 0.0970 0.1000 0.1220 0.1220 0.1655 0.1699 0.1112 0.1185 0.1432 0.1465 0.1606 0.1609 0.1610
va: 2.1243 1.9894 2.2724 3.6730 3.7808 3.8907 3.9073 3.9000 3.8632 4.1551 3.7028 3.9276 3.9407 3.7801 3.6332 4.0229 3.9467 3.6274 3.8123 3.5881 3.9503 3.9355 3.8879 3.9009 3.8944 1.0281 1.0361 1.0020 1.0029 1.0019 0.9993 1.0178 1.0006 1.0066 0.9953 0.9959 1.0075 1.0083 0.9973 0.9985 1.0123 0.9977 1.0048 1.0069 1.0093 1.0062 1.0043 1.0023 0.9897 0.9901 0.9895
dispcorr: -0.022163485 hartree
energy: -1079.761974117093
dipole: 25.17034 -25.09671 0.07363 18.14835 -18.19210 -0.04375 -7.23770 6.04799 -1.18971
magnitude: 1.19279 au
magnitude: 3.03183 debye
