program: Orca
programVersion: 5.0.2
elementType: O O O C C C C C C C C C C C C C C C C C C C C C C H H H H H H H H H H H H H H H H H H H H H H H H H H
charge: 0
multiplicity: 1
keywords: wb97x-d3
keywords: def2-TZVPP
keywords: def2/J RIJCOSX
keywords: DEFGRID2
keywords: scfconv7
keywords: smallprint printgap noloewdin
keywords: NOSOSCF
formula: C22H26O3
InChI: InChI=1/C22H26O3/c1-15(2)10-19-20(22(19,3)4)21(23)25-14-17-12-18(24-13-17)11-16-8-6-5-7-9-16/h5-10,12-13,19-20H,11,14H2,1-4H3
51 atoms
O  1.594484 -1.98045 -0.419648
O  0.697726 -0.447939 -1.779169
O  -2.891982 -2.231262 -0.247352
C  2.138239 1.480889 0.290784
C  2.831669 1.461071 -1.028274
C  2.514128 0.145221 -0.337879
C  2.916305 1.845006 1.532218
C  0.694605 1.915858 0.355196
C  4.238935 1.888518 -1.213723
C  1.50737 -0.751297 -0.930803
C  4.946752 1.699969 -2.331249
C  6.351031 2.204955 -2.459529
C  4.413954 0.987438 -3.536267
C  0.643528 -2.96254 -0.860314
C  -0.717535 -2.668342 -0.342169
C  -1.085004 -2.423428 1.020497
C  -1.853793 -2.532507 -1.061112
C  -2.411427 -2.157374 1.021331
C  -3.351557 -1.724474 2.081375
C  -3.776872 -0.278265 1.94168
C  -5.052689 0.116629 2.333507
C  -2.899039 0.688618 1.457484
C  -5.442239 1.44692 2.249539
C  -3.285755 2.018384 1.36991
C  -4.559311 2.403686 1.766745
H  2.178944 1.661293 -1.872802
H  3.340845 -0.363234 0.145024
H  2.977173 2.929523 1.642868
H  3.932358 1.452044 1.524887
H  2.41896 1.451211 2.42023
H  0.172106 1.40613 1.167029
H  0.147628 1.733849 -0.567438
H  0.644138 2.987665 0.556409
H  4.714292 2.40667 -0.386317
H  7.046286 1.383856 -2.651698
H  6.444319 2.89116 -3.305267
H  6.683715 2.728091 -1.563233
H  3.447212 0.515265 -3.367511
H  4.308596 1.675952 -4.379152
H  5.111014 0.211477 -3.86131
H  1.025344 -3.900109 -0.458379
H  0.642833 -3.041149 -1.94894
H  -0.438398 -2.425668 1.884108
H  -2.068535 -2.621163 -2.114686
H  -2.854335 -1.867938 3.04376
H  -4.237991 -2.363871 2.097433
H  -5.749732 -0.624395 2.707092
H  -1.901328 0.406096 1.142403
H  -6.438872 1.734717 2.558661
H  -2.587309 2.753294 0.989053
H  -4.862786 3.440102 1.696862
elementType: O C H
totalener: -1079.73957661 hartree
nucrepener: 2130.66067876 hartree
electener: -3210.40025537 hartree
oneelecener: -5700.88275022 hartree
twoeener: 2490.48249485 hartree
cpcmener: -0.03115914 hartree
kineticenergy: 1074.85992859 hartree
xcener: -106.464128473922 hartree
chargesum: 0.0000000
charge: -0.291593 -0.501823 -0.287900 0.187988 -0.053173 -0.080728 -0.300808 -0.309312 -0.275395 0.411769 -0.016400 -0.230385 -0.252780 0.101835 -0.063510 -0.335850 -0.035983 0.197345 -0.031987 -0.013656 -0.173909 -0.157268 -0.165124 -0.184719 -0.160322 0.099600 0.093565 0.103262 0.090867 0.100013 0.097957 0.097012 0.104221 0.126598 0.095219 0.094610 0.089210 0.080456 0.101210 0.094997 0.121069 0.121181 0.159246 0.178983 0.105012 0.106242 0.142074 0.141646 0.159103 0.159571 0.160761
qa: -0.2916 -0.5018 -0.2879 0.1880 -0.0532 -0.0807 -0.3008 -0.3093 -0.2754 0.4118 -0.0164 -0.2304 -0.2528 0.1018 -0.0635 -0.3358 -0.0360 0.1973 -0.0320 -0.0137 -0.1739 -0.1573 -0.1651 -0.1847 -0.1603 0.0996 0.0936 0.1033 0.0909 0.1000 0.0980 0.0970 0.1042 0.1266 0.0952 0.0946 0.0892 0.0805 0.1012 0.0950 0.1211 0.1212 0.1592 0.1790 0.1050 0.1062 0.1421 0.1416 0.1591 0.1596 0.1608
va: 2.1159 1.9903 2.2630 3.7150 3.8417 3.8307 3.9136 3.8733 3.8825 4.1205 3.7066 3.9286 3.9437 3.8279 3.6135 3.9639 3.9548 3.6328 3.8318 3.7240 3.9128 3.8830 3.8950 3.9066 3.8919 1.0241 1.0326 0.9984 1.0012 1.0019 0.9966 1.0141 1.0023 1.0032 0.9961 0.9950 1.0070 1.0164 0.9975 0.9986 0.9893 1.0049 1.0109 0.9944 1.0033 1.0095 1.0017 0.9935 0.9901 0.9925 0.9901
dispcorr: -0.024545044 hartree
energy: -1079.764121655613
dipole: 22.61120 -21.72655 0.88465 15.47852 -15.80270 -0.32418 -2.59915 3.51789 0.91874
magnitude: 1.31597 au
magnitude: 3.34494 debye
