program: Gaussian 09
title: 000071546
version: EM64L-G09RevD.01
frameworkgroup: C1[X(C9H13NO2)]
method: RPBEPBE
basis: SDD
operation: Freq
keyword: #p
keyword: freq=noraman
keyword: PBEPBE/SDD
title: #p freq=noraman PBEPBE/SDD
converged: YES YES NO NO
title: Mulliken charges:
elementType: O O N C C C C C C C C C H H H H H H H H H H H H H
charge: -0.474575 -0.438711 -0.365083 -0.180317 -0.433978 0.482204 -0.517884 -0.455908 0.315135 -0.191941 -0.414827 -0.614906 0.201280 0.241157 0.218634 0.303374 0.228920 0.276337 0.221285 0.361634 0.217168 0.237066 0.205775 0.227894 0.350267
chargesum: 0.00000
title: Mulliken charges with hydrogens summed into heavy atoms:
elementType: O O N C C C C C C C C C
charge: -0.112941 -0.088445 -0.088746 0.020963 0.025814 0.482204 -0.214509 -0.226987 0.315135 0.029343 -0.197659 0.055830
polarizability: 1.49386708e+02 -1.59105461e+00 1.12897548e+02 -1.07558768e+01 1.28824998e+00 7.05898832e+01
1716.lowfreq: -19.2220 -8.5602 -0.0003 0.0004 0.0009 9.1982 23.8496 64.1877 80.2808
frequency: 20.9336 64.1410 80.2710 119.3592 187.0722 193.6006 221.8840 244.2787 286.8061 352.4445 360.5354 366.4893 410.3209 461.9003 516.7733 540.4143 590.6679 618.2988 654.7353 697.1560 740.9178 776.8236 792.0823 861.6586 866.4147 918.3786 931.7357 955.6078 967.2825 984.2589 1005.1307 1036.6213 1087.1916 1106.6057 1120.3055 1132.4236 1151.3589 1166.6175 1180.1020 1234.4196 1254.2611 1260.3460 1286.7874 1314.6009 1330.1034 1392.8575 1399.9530 1434.6793 1442.4850 1464.0751 1466.2684 1470.8242 1482.1232 1492.5275 1593.4196 1629.6799 2899.8275 2917.4066 2940.7089 3034.2369 3048.0151 3087.0145 3111.5709 3122.0920 3152.8081 3185.4732 3247.6453 3440.9885 3579.5011
redmass: 4.3336 2.8469 3.5770 2.1597 3.8518 1.8904 4.2973 2.0760 4.0218 3.4800 1.1283 3.5351 3.5356 3.2388 5.7611 3.8200 4.2726 3.1957 1.3568 1.9989 3.9565 1.6185 1.2432 1.5941 2.2022 1.4074 2.6917 1.3267 2.2432 5.9469 2.1502 3.4327 1.5627 1.4535 1.6845 1.5573 2.6943 1.2499 1.2894 1.4371 1.4951 1.8970 1.2590 1.2144 1.2574 1.9229 3.9988 1.1450 1.2163 1.4824 1.6455 1.0689 2.6660 1.0432 6.6481 6.4812 1.0827 1.0504 1.0665 1.0819 1.0954 1.1010 1.0875 1.0902 1.0986 1.0919 1.0633 1.0744 1.0659
irintensity: 1.8403 1.5070 3.7331 0.7951 1.7024 2.6152 0.6944 9.7764 0.8103 13.4691 136.9543 8.4663 7.3672 4.0554 1.6859 4.5520 5.3383 9.5708 28.4679 36.6112 50.3434 12.4266 186.7815 1.4693 9.2121 29.4119 45.0168 0.0652 43.2422 6.8776 6.1379 58.7263 0.8082 8.0877 86.2755 76.9829 31.8595 38.9332 26.3373 19.5023 1.6435 31.8235 15.8190 74.7575 4.1155 95.4708 2.8009 1.5113 10.7861 30.3443 27.5813 17.0085 7.3731 15.8275 51.4128 61.9567 59.1680 119.1795 65.1557 39.5529 17.3188 33.1478 8.2109 22.8616 24.7585 2.8966 171.9763 0.0010 30.1522
temp: 298.150 k
press: 1.00000 atm
elementType: 8 8 7 6 6 6 6 6 6 6 6 6 1 1 1 1 1 1 1 1 1 1 1 1 1
symmnumber: 1
zpe: 541228.3 jmol-1
zpe.correction: 0.206143 hartree
zpe.thermalcorrener: 0.218301 hartree
zpe.thermalcorrenthalpy: 0.219245 hartree
zpe.thermalcorrgfe: 0.166841 hartree
zpe.sumelectzpe: -555.014244 hartree
zpe.sumelectthermal: -555.002087 hartree
zpe.sumelectthermalent: -555.001143 hartree
zpe.sumelectthermalfe: -555.053547 hartree
dipole: -1.5249 3.0473 -2.2253
dipole: 4.0698
quadrupole: -46.3413 -72.9785 -76.6515
quadrupole: -1.4110 -2.3361 3.9484
quadrupole: 18.9824 -7.6547 -11.3278 -1.4110 -2.3361 3.9484
hfenergy: -555.2203874 hartree
pointgroup: C01 [X(C9H13N1O2)]
dipole: 0.5187961 -0.5288119 -1.4195145 debye
dipolederiv: -0.6910279 -0.0637727 -0.0247011 -0.137611 -0.5124921 -0.0018719 -0.1783733 -0.0534895 -0.7328759 -0.520761 0.4906972 0.300718 0.6097188 -0.9983917 -0.1958397 0.3410964 -0.194127 -0.4516274 -0.8143712 -0.1868842 0.1013557 -0.2365198 -0.2222774 0.0166931 0.1662177 0.0177282 -0.6473389 0.2544686 0.0309213 0.0992583 0.0731301 0.4749037 0.0166623 0.3375734 0.0506375 0.4151865 0.5093338 0.0685061 0.1151463 -0.0198571 0.134371 0.1016319 -0.1152474 0.1061791 0.1399367 0.3710136 -0.0514613 0.0012808 -0.0093399 0.1030277 0.1013333 0.0958374 0.0990147 -0.0173348 -0.3696098 0.2474821 0.1415319 0.0616849 -0.1865152 -0.0100472 0.0259831 0.078737 -0.0814893 -0.2872048 -0.0797472 -0.0330568 -0.0782918 -0.1003102 0.0416185 -0.0647484 0.0358231 -0.1984905 0.5773068 -0.5460728 -0.2059657 -0.6267948 0.8716339 0.3240955 -0.2365717 0.3176994 0.2207985 0.1850085 -0.0100347 0.0883141 -0.1083819 0.0758088 0.0872324 0.0344716 0.1184637 -0.0391536 -0.0682166 -0.0928801 0.0187431 0.1770031 -0.3284166 -0.0131233 0.1640491 -0.0926656 -0.2342623 0.2823288 0.099814 -0.1402788 0.2871322 0.2767245 -0.1058125 -0.1937455 -0.0405979 0.3815064 -0.0402671 0.0446232 -0.0357145 0.0405487 -0.2321838 0.0061751 -0.0179146 -0.0060173 -0.0109308 0.0648344 0.0248031 -0.0159787 0.0383385 -0.0896025 0.0733389 -0.0472076 0.0230935 0.0530547 -0.039062 -0.0401181 -0.0176885 -0.0564222 -0.0263142 -0.144526 -0.071165 -0.1122313 -0.1237211 0.158279 -0.0257463 -0.033338 -0.0346843 0.0752883 -0.0549026 -0.0200183 -0.06321 0.1185791 0.032681 0.1183111 0.018251 0.1059489 -0.0224071 -0.0762413 0.0142664 -0.0688032 0.1138919 0.09211 -0.0020392 -0.0002338 0.0424642 -0.0061439 0.0659972 0.0255455 -0.0154572 0.2882621 0.0298238 -0.0601226 -0.073025 -0.0625542 0.0012127 -0.1115244 -0.0832141 -0.1133016 0.0590719 0.3652472 -0.0027735 -0.1295541 0.0054612 0.2668957 -0.010473 -0.123145 -0.023433 0.4584863 -0.1286733 0.0613122 -0.060449 0.0795525 0.0886332 -0.0306468 -0.0506977 -0.0365594 0.1382888 0.0680026 0.1209949 0.0093164 0.034064 -0.1171687 0.019845 0.0461605 -0.002761 0.071508 0.0091486 -0.0419194 0.0458537 -0.0485105 0.0188892 -0.0650515 0.1993651 -0.0011396 -0.2666675 -0.185935 -0.0436609 -0.0546395 -0.0160616 0.1024801 0.0155048 -0.098913 0.0154151 0.0358561 0.1455423 -0.0602321 -0.1151459 -0.120018 0.3523544 -0.0500677 -0.1496046 -0.0389977 0.3094651 unknown
polarizability: 149.4833249|-8.0779871|101.5342638|5.6681675|19.172979|81.8565496 unknown
InChI: InChI=1S/C9H13NO2/c1-10-6-9(12)7-3-2-4-8(11)5-7/h2-5,9-12H,6H2,1H3
charge 0 multiplicity 1
25 atoms
O  1.546189 0.174835 1.690889
O  -3.004917 1.981364 0.810391
N  3.481437 -0.085447 -0.15326
C  1.178865 -0.633798 0.535278
C  2.088516 -0.190357 -0.655158
C  -0.295102 -0.462868 0.2004
C  -1.002773 0.664151 0.667452
C  -0.949114 -1.42028 -0.619419
C  -2.357457 0.835908 0.307246
C  -2.302241 -1.236301 -0.9751
C  -3.017918 -0.106653 -0.517617
C  4.377471 0.812001 -0.91518
H  1.378919 -1.71072 0.746938
H  1.772677 0.818398 -0.979284
H  1.965085 -0.879912 -1.519045
H  -0.507235 1.382931 1.324334
H  -0.408442 -2.309461 -0.965655
H  3.903149 -1.012776 -0.004193
H  -2.809459 -1.975531 -1.605061
H  2.52423 0.367543 1.53039
H  -4.072273 0.031178 -0.791724
H  3.973213 1.839277 -0.886633
H  4.504969 0.524797 -1.98362
H  5.373939 0.828367 -0.439963
H  -3.951427 2.001956 0.522694
