program: Orca
programVersion: 5.0.2
elementType: O O O C C C C C C C C C C C C C C C C C C C C C C H H H H H H H H H H H H H H H H H H H H H H H H H H
charge: 0
multiplicity: 1
keywords: wb97x-d3
keywords: def2-TZVPP
keywords: def2/J RIJCOSX
keywords: DEFGRID2
keywords: scfconv7
keywords: smallprint printgap noloewdin
keywords: NOSOSCF
formula: C22H26O3
InChI: InChI=1/C22H26O3/c1-15(2)10-19-20(22(19,3)4)21(23)25-14-17-12-18(24-13-17)11-16-8-6-5-7-9-16/h5-10,12-13,19-20H,11,14H2,1-4H3
51 atoms
O  1.555527 -1.817748 -0.231797
O  1.835378 -0.051989 1.114711
O  -2.898369 -1.703045 -0.486628
C  4.566418 0.125258 -0.4282
C  3.618497 1.159543 -0.952125
C  3.164168 -0.27862 -0.861858
C  5.685789 -0.350436 -1.32107
C  4.948764 0.161743 1.030684
C  3.789009 1.780886 -2.288259
C  2.133751 -0.669504 0.115769
C  4.255509 3.013656 -2.507558
C  4.386794 3.558538 -3.897143
C  4.693006 3.944748 -1.419068
C  0.525219 -2.360247 0.615226
C  -0.817016 -1.809822 0.288539
C  -1.364157 -0.517016 0.588862
C  -1.796186 -2.477128 -0.36524
C  -2.623412 -0.505335 0.095139
C  -3.710399 0.506494 0.123933
C  -4.818507 0.105398 1.067556
C  -5.932672 -0.589822 0.607678
C  -4.718909 0.392395 2.426525
C  -6.928673 -0.991012 1.488984
C  -5.713478 -0.004537 3.308806
C  -6.822072 -0.70002 2.842109
H  3.204294 1.806411 -0.184349
H  3.125604 -0.824687 -1.798294
H  6.521663 0.35146 -1.286009
H  5.380417 -0.450116 -2.362245
H  6.056055 -1.321902 -0.988398
H  5.127352 -0.843313 1.419564
H  4.203214 0.641965 1.660512
H  5.87788 0.724612 1.144087
H  3.517564 1.173771 -3.147507
H  5.423872 3.825822 -4.116302
H  4.05482 2.845935 -4.652267
H  3.801476 4.474193 -4.016794
H  4.114226 4.871829 -1.442395
H  4.60328 3.518241 -0.421389
H  5.737757 4.232423 -1.562569
H  0.779695 -2.206601 1.664582
H  0.544448 -3.431988 0.422223
H  -0.888957 0.296872 1.112171
H  -1.850638 -3.47076 -0.783285
H  -4.110942 0.657938 -0.881742
H  -3.273389 1.454574 0.439747
H  -6.025657 -0.815702 -0.448009
H  -3.855474 0.933279 2.796506
H  -7.79017 -1.53045 1.116736
H  -5.62451 0.231467 4.361465
H  -7.598939 -1.009838 3.528869
elementType: O C H
totalener: -1079.74048958 hartree
nucrepener: 2030.11320853 hartree
electener: -3109.85369811 hartree
oneelecener: -5499.76180153 hartree
twoeener: 2389.90810342 hartree
cpcmener: -0.02962718 hartree
kineticenergy: 1074.83993678 hartree
xcener: -106.456860173897 hartree
chargesum: -0.0000000
charge: -0.289368 -0.511005 -0.287300 0.149744 -0.001751 -0.125377 -0.268092 -0.300052 -0.271848 0.445407 -0.034042 -0.230256 -0.251875 0.072251 -0.092690 -0.294949 -0.035814 0.190687 -0.053322 0.054837 -0.200572 -0.206912 -0.158547 -0.155632 -0.178754 0.097382 0.091301 0.096084 0.091668 0.098514 0.103125 0.092908 0.096615 0.124754 0.094681 0.089543 0.095171 0.098742 0.088170 0.096800 0.119883 0.120308 0.161403 0.179002 0.114739 0.113400 0.143283 0.145577 0.160358 0.160621 0.161199
qa: -0.2894 -0.5110 -0.2873 0.1497 -0.0018 -0.1254 -0.2681 -0.3001 -0.2718 0.4454 -0.0340 -0.2303 -0.2519 0.0723 -0.0927 -0.2949 -0.0358 0.1907 -0.0533 0.0548 -0.2006 -0.2069 -0.1585 -0.1556 -0.1788 0.0974 0.0913 0.0961 0.0917 0.0985 0.1031 0.0929 0.0966 0.1248 0.0947 0.0895 0.0952 0.0987 0.0882 0.0968 0.1199 0.1203 0.1614 0.1790 0.1147 0.1134 0.1433 0.1456 0.1604 0.1606 0.1612
va: 2.1224 1.9859 2.2692 3.6544 3.7746 3.9072 3.9087 3.9002 3.8707 4.1106 3.7038 3.9262 3.9429 3.8382 3.6760 4.0149 3.9658 3.6743 3.8140 3.5730 3.9522 3.9391 3.8893 3.8885 3.8955 1.0255 1.0375 1.0026 1.0024 1.0026 0.9986 1.0183 1.0006 1.0065 0.9959 1.0077 0.9954 0.9980 1.0081 0.9971 1.0085 0.9994 1.0182 0.9923 1.0069 1.0088 1.0061 1.0027 0.9897 0.9897 0.9895
dispcorr: -0.021988794 hartree
energy: -1079.762478370202
dipole: 29.32984 -28.73115 0.59869 15.00678 -15.12869 -0.12191 -8.22799 7.55136 -0.67663
magnitude: 0.91166 au
magnitude: 2.31725 debye
