program: Gaussian 09
title: 000071545
version: EM64L-G09RevD.01
frameworkgroup: C1[X(C15H11N)]
method: RPBEPBE
basis: SDD
operation: Freq
keyword: #pfreq=noraman
keyword: PBEPBE/SDD
title: #p freq=noraman PBEPBE/SDD
converged: NO YES NO NO
title: Mulliken charges:
elementType: N C C C C C C C C C C C C C C C H H H H H H H H H H H
charge: 0.002276 0.425592 -0.050656 -0.099332 0.337681 -0.305783 -0.299778 -0.389658 -0.322805 -0.383465 -0.383455 -0.248357 -0.219607 -0.221173 -0.221162 -0.238095 0.243355 0.249363 0.233631 0.264802 0.241498 0.241505 0.230144 0.232117 0.226529 0.226530 0.228303
chargesum: 0.00000
title: Mulliken charges with hydrogens summed into heavy atoms:
elementType: N C C C C C C C C C C C C C C C
charge: 0.002276 0.425592 -0.050656 -0.099332 0.337681 -0.062428 -0.050416 -0.156028 -0.058003 -0.141967 -0.141950 -0.018212 0.012510 0.005356 0.005368 -0.009792
polarizability: 2.65300281e+02 6.79096713e+00 1.34219206e+02 -7.95933766e-04 9.12516745e-03 1.06043196e+02
1716.lowfreq: -61.7625 -9.2189 -0.0004 0.0003 0.0008 5.8953 10.5272 52.8291 71.4642
frequency: -61.7621 52.7994 71.4642 166.0972 169.2649 246.3502 262.0003 347.1540 390.6935 394.7876 400.3015 477.3236 514.7546 534.5846 551.1536 557.1335 613.4650 616.7744 687.8592 698.3070 703.3653 746.2871 766.2359 773.9743 804.5822 845.6783 852.5666 852.6076 886.9027 921.6316 923.4393 965.0929 974.1722 984.7843 988.3184 994.4339 997.7806 1014.6975 1019.6475 1056.8528 1077.6158 1113.8256 1146.9699 1165.9871 1172.0610 1187.2247 1232.7167 1247.8609 1282.2351 1289.4525 1310.9838 1350.3955 1370.3388 1401.1048 1414.1348 1427.4125 1453.2962 1483.6355 1502.7300 1544.7657 1585.5660 1591.2917 1613.7899 1625.8344 3119.3462 3121.9630 3126.6200 3128.5967 3135.6158 3140.3583 3149.4369 3154.6511 3160.2381 3163.8314 3170.0518
redmass: 3.9419 4.9255 4.9533 3.9993 4.7295 4.8806 5.6600 5.2161 4.0663 2.8833 3.2558 2.8969 7.0184 4.4259 3.5153 5.1056 6.3001 6.9534 6.2053 2.9638 1.6989 3.8630 1.3609 2.3199 3.0074 1.5049 5.3744 1.2499 1.7052 1.4701 5.0033 1.3545 1.3885 1.3748 5.9886 1.3268 1.3313 2.4664 2.7538 2.4314 1.6059 1.7512 1.2107 1.1143 1.0527 1.1162 1.9060 1.7626 3.0755 2.6185 1.3589 4.6067 7.1531 4.3696 2.2072 2.1931 2.7220 2.7580 3.4701 7.3712 6.0456 6.4161 6.2768 6.6317 1.0874 1.0844 1.0891 1.0877 1.0891 1.0926 1.0969 1.0951 1.0972 1.1018 1.0992
irintensity: 0.2944 1.1841 1.2545 3.8045 0.4571 0.0564 0.1489 0.5256 4.6892 0.0010 0.4870 11.0998 0.5546 7.8709 0.0051 5.3170 0.1744 6.6906 3.2845 0.0563 56.2182 13.1376 57.7222 33.7822 0.0898 63.1855 1.2013 2.3534 3.0943 2.7368 6.6857 2.0270 0.1301 2.4707 1.6398 0.0961 0.0858 0.9263 25.7202 2.1915 8.2143 12.2169 0.4026 1.5756 0.0256 2.1291 1.7003 4.6391 9.1615 5.4652 0.5561 14.0853 0.0353 8.8526 16.1793 7.7505 9.0338 21.0684 25.4516 22.0357 1.1584 46.9374 0.0841 8.2174 3.6767 1.6630 8.9538 0.5231 12.7966 19.4971 39.2132 26.9712 13.4745 27.6146 20.6105
temp: 298.150 k
press: 1.00000 atm
elementType: 7 6 6 6 6 6 6 6 6 6 6 6 6 6 6 6 1 1 1 1 1 1 1 1 1 1 1
symmnumber: 1
zpe: 556187.3 jmol-1
zpe.correction: 0.211841 hartree
zpe.thermalcorrener: 0.222756 hartree
zpe.thermalcorrenthalpy: 0.223700 hartree
zpe.thermalcorrgfe: 0.174482 hartree
zpe.sumelectzpe: -631.878844 hartree
zpe.sumelectthermal: -631.867929 hartree
zpe.sumelectthermalent: -631.866985 hartree
zpe.sumelectthermalfe: -631.916203 hartree
dipole: -0.9618 1.8717 -0.0010
dipole: 2.1043
quadrupole: -74.0895 -88.7854 -90.9585
quadrupole: -0.8523 0.0009 0.0042
quadrupole: 10.5216 -4.1743 -6.3473 -0.8523 0.0009 0.0042
hfenergy: -632.090685 hartree
pointgroup: C01 [X(C15H11N1)]
dipole: 0.3769054 0.7371416 0.0000842 debye
polarizability: 265.3276243|-6.5216759|134.1918487|0.0012866|-0.0214677|106.0432095 unknown
InChI: InChI=1S/C15H11N/c1-2-6-12(7-3-1)15-11-10-13-8-4-5-9-14(13)16-15/h1-11H
charge 0 multiplicity 1
27 atoms
N  0.358838 -0.76165 -0.000004
C  2.305048 0.797832 0.000082
C  -0.466429 0.308648 0.000068
C  1.730491 -0.534654 -0.000001
C  -1.948928 0.051924 0.000075
C  1.394147 1.903464 0.000155
C  0.020135 1.663576 0.000153
C  3.729635 0.947362 0.000078
C  2.60469 -1.669499 -0.000073
C  -2.657387 -0.061837 -1.222467
C  -2.657121 -0.063414 1.222629
C  4.557737 -0.177348 -0.000015
C  3.990524 -1.493097 -0.000088
C  -4.052313 -0.290369 -1.222412
C  -4.052048 -0.291945 1.222578
C  -4.753897 -0.404776 0.000087
H  1.784404 2.92824 0.000224
H  -0.701564 2.486243 0.000225
H  4.15924 1.956791 0.000136
H  2.145366 -2.662729 -0.000137
H  -2.113283 0.017863 -2.17048
H  -2.112802 0.015054 2.170621
H  5.646993 -0.059503 -0.000032
H  4.653807 -2.36532 -0.000157
H  -4.588401 -0.381268 -2.173978
H  -4.587925 -0.384054 2.174144
H  -5.835256 -0.582834 0.000091
