program: Orca
programVersion: 5.0.2
elementType: O O O C C C C C C C C C C C C C C C C C C C C C C H H H H H H H H H H H H H H H H H H H H H H H H H H
charge: 0
multiplicity: 1
keywords: wb97x-d3
keywords: def2-TZVPP
keywords: def2/J RIJCOSX
keywords: DEFGRID2
keywords: scfconv7
keywords: smallprint printgap noloewdin
keywords: NOSOSCF
formula: C22H26O3
InChI: InChI=1/C22H26O3/c1-15(2)10-19-20(22(19,3)4)21(23)25-14-17-12-18(24-13-17)11-16-8-6-5-7-9-16/h5-10,12-13,19-20H,11,14H2,1-4H3
51 atoms
O  1.34121 -1.501209 -1.202055
O  0.620627 0.600698 -1.472813
O  -1.716675 -1.588604 1.683633
C  3.19912 1.180516 0.282174
C  3.445792 1.543713 -1.14083
C  2.885243 0.173303 -0.817563
C  4.36559 0.809938 1.164826
C  2.084904 1.87022 1.030153
C  4.812891 1.659627 -1.711962
C  1.50814 -0.173811 -1.195362
C  5.140519 1.346512 -2.968254
C  6.542206 1.500482 -3.47269
C  4.158966 0.818946 -3.968859
C  0.047881 -2.015608 -1.509017
C  -0.880316 -1.906178 -0.349909
C  -2.284374 -2.186133 -0.371195
C  -0.591677 -1.552675 0.922647
C  -2.739609 -1.979229 0.886676
C  -4.092387 -2.04639 1.493266
C  -4.592228 -0.681225 1.903273
C  -4.84965 0.288343 0.935895
C  -4.784623 -0.361044 3.242111
C  -5.294312 1.549704 1.300494
C  -5.229484 0.903087 3.611242
C  -5.486004 1.861391 2.641776
H  2.709214 2.225788 -1.559707
H  3.584163 -0.652766 -0.879897
H  4.831725 1.703394 1.585077
H  5.134004 0.251441 0.630479
H  4.027924 0.191458 1.998344
H  1.296738 2.243741 0.379688
H  2.489223 2.727894 1.571315
H  1.630782 1.203409 1.765913
H  5.587383 2.045633 -1.054777
H  7.219982 1.865078 -2.701224
H  6.929618 0.547426 -3.841558
H  6.582183 2.195589 -4.315121
H  4.450537 -0.179157 -4.305994
H  3.141227 0.759442 -3.587442
H  4.144585 1.450613 -4.860553
H  0.213715 -3.061419 -1.770113
H  -0.370993 -1.526635 -2.39138
H  -2.87489 -2.494797 -1.219733
H  0.317333 -1.259187 1.424499
H  -4.087375 -2.71378 2.358845
H  -4.765403 -2.489647 0.757194
H  -4.698222 0.052787 -0.111417
H  -4.586596 -1.105728 4.003819
H  -5.492382 2.291509 0.5376
H  -5.374984 1.137309 4.657924
H  -5.832896 2.84606 2.926848
elementType: O C H
totalener: -1079.73934864 hartree
nucrepener: 2076.54643858 hartree
electener: -3156.28578722 hartree
oneelecener: -5592.70602747 hartree
twoeener: 2436.42024025 hartree
cpcmener: -0.03260657 hartree
kineticenergy: 1074.85633082 hartree
xcener: -106.463245562049 hartree
chargesum: -0.0000000
charge: -0.296806 -0.496363 -0.292932 0.160093 -0.022812 -0.097515 -0.287264 -0.282818 -0.298020 0.384438 -0.014406 -0.228677 -0.243008 0.108908 -0.030658 -0.353789 -0.061062 0.211668 -0.050840 0.017015 -0.189076 -0.184324 -0.164395 -0.159099 -0.171891 0.104631 0.094885 0.099471 0.093495 0.098164 0.092646 0.100003 0.096770 0.124795 0.090067 0.094750 0.096557 0.099335 0.080478 0.101890 0.124529 0.116346 0.164048 0.175297 0.107792 0.117897 0.146395 0.142813 0.160270 0.159871 0.160439
qa: -0.2968 -0.4964 -0.2929 0.1601 -0.0228 -0.0975 -0.2873 -0.2828 -0.2980 0.3844 -0.0144 -0.2287 -0.2430 0.1089 -0.0307 -0.3538 -0.0611 0.2117 -0.0508 0.0170 -0.1891 -0.1843 -0.1644 -0.1591 -0.1719 0.1046 0.0949 0.0995 0.0935 0.0982 0.0926 0.1000 0.0968 0.1248 0.0901 0.0948 0.0966 0.0993 0.0805 0.1019 0.1245 0.1163 0.1640 0.1753 0.1078 0.1179 0.1464 0.1428 0.1603 0.1599 0.1604
va: 2.1107 1.9906 2.2572 3.6905 3.8305 3.8026 3.9070 3.8878 3.8890 4.1403 3.7065 3.9296 3.9367 3.8135 3.6128 4.0031 3.9477 3.6126 3.8164 3.6201 3.9259 3.9380 3.9034 3.8879 3.8905 1.0253 1.0323 0.9996 1.0019 1.0026 1.0164 1.0022 1.0018 1.0027 1.0061 0.9963 0.9961 0.9984 1.0147 0.9992 0.9917 1.0108 1.0049 0.9956 1.0083 1.0059 1.0028 1.0031 0.9905 0.9900 0.9896
dispcorr: -0.023158359 hartree
energy: -1079.762507000753
dipole: 24.68327 -24.04899 0.63428 9.45576 -10.36019 -0.90443 -7.44941 7.22376 -0.22565
magnitude: 1.12748 au
magnitude: 2.86583 debye
