program: Orca
programVersion: 5.0.2
elementType: O O O C C C C C C C C C C C C C C C C C C C C C C H H H H H H H H H H H H H H H H H H H H H H H H H H
charge: 0
multiplicity: 1
keywords: wb97x-d3
keywords: def2-TZVPP
keywords: def2/J RIJCOSX
keywords: DEFGRID2
keywords: scfconv7
keywords: smallprint printgap noloewdin
keywords: NOSOSCF
formula: C22H26O3
InChI: InChI=1/C22H26O3/c1-15(2)10-19-20(22(19,3)4)21(23)25-14-17-12-18(24-13-17)11-16-8-6-5-7-9-16/h5-10,12-13,19-20H,11,14H2,1-4H3
51 atoms
O  1.358503 -1.48388 -1.151873
O  0.718147 0.63858 -1.461981
O  -1.808966 -1.501227 1.612028
C  3.237136 1.127789 0.411999
C  3.549646 1.498998 -0.996141
C  2.938744 0.142186 -0.711696
C  4.358013 0.716116 1.335011
C  2.113713 1.840597 1.123402
C  4.942369 1.581732 -1.508157
C  1.567688 -0.162616 -1.144701
C  5.32014 1.249651 -2.745209
C  6.747827 1.362254 -3.182914
C  4.373281 0.737749 -3.786497
C  0.065466 -1.962103 -1.512888
C  -0.900687 -1.844945 -0.386295
C  -2.298178 -2.151194 -0.447129
C  -0.660329 -1.460343 0.887346
C  -2.797977 -1.927223 0.790621
C  -4.167968 -2.008684 1.35495
C  -4.705032 -0.645897 1.723594
C  -4.973999 -0.315353 3.046465
C  -4.921172 0.310863 0.733611
C  -5.453792 0.946638 3.377593
C  -5.400057 1.570044 1.060225
C  -5.668321 1.892236 2.385733
H  2.851254 2.208235 -1.435186
H  3.616038 -0.702905 -0.756197
H  5.13169 0.142777 0.824437
H  3.972337 0.098472 2.147969
H  4.831009 1.592467 1.782789
H  2.517493 2.689541 1.678641
H  1.621667 1.182948 1.842996
H  1.355472 2.230231 0.447048
H  5.694968 1.955839 -0.819428
H  6.84626 2.041334 -4.033492
H  7.395843 1.723118 -2.384611
H  7.128997 0.393811 -3.516676
H  4.423568 1.356221 -4.686067
H  4.649153 -0.273905 -4.095515
H  3.336504 0.716122 -3.455867
H  0.214171 -3.008581 -1.781639
H  -0.308555 -1.451634 -2.403256
H  -2.854777 -2.489503 -1.30724
H  0.226626 -1.141341 1.412796
H  -4.179156 -2.660166 2.232501
H  -4.809097 -2.47752 0.606286
H  -4.807829 -1.049975 3.825401
H  -4.709395 0.067265 -0.301312
H  -5.658844 1.189159 4.412335
H  -5.564769 2.301905 0.279994
H  -6.042098 2.875176 2.641245
elementType: O C H
totalener: -1079.73932815 hartree
nucrepener: 2074.13897346 hartree
electener: -3153.87830161 hartree
oneelecener: -5587.84588800 hartree
twoeener: 2433.96758638 hartree
cpcmener: -0.03257481 hartree
kineticenergy: 1074.85630422 hartree
xcener: -106.463254186048 hartree
chargesum: 0.0000000
charge: -0.296276 -0.496064 -0.293290 0.160337 -0.019399 -0.103414 -0.286422 -0.284011 -0.299031 0.386027 -0.015095 -0.228639 -0.241891 0.105672 -0.027177 -0.355322 -0.061855 0.214048 -0.050819 0.014793 -0.184159 -0.188201 -0.158200 -0.164769 -0.172229 0.104405 0.095693 0.093695 0.098153 0.099428 0.100461 0.096494 0.092605 0.124678 0.096355 0.090271 0.094757 0.101913 0.099383 0.080407 0.125256 0.116889 0.163705 0.175700 0.107452 0.117835 0.142936 0.146411 0.159539 0.160211 0.160754
qa: -0.2963 -0.4961 -0.2933 0.1603 -0.0194 -0.1034 -0.2864 -0.2840 -0.2990 0.3860 -0.0151 -0.2286 -0.2419 0.1057 -0.0272 -0.3553 -0.0619 0.2140 -0.0508 0.0148 -0.1842 -0.1882 -0.1582 -0.1648 -0.1722 0.1044 0.0957 0.0937 0.0982 0.0994 0.1005 0.0965 0.0926 0.1247 0.0964 0.0903 0.0948 0.1019 0.0994 0.0804 0.1253 0.1169 0.1637 0.1757 0.1075 0.1178 0.1429 0.1464 0.1595 0.1602 0.1608
va: 2.1114 1.9909 2.2566 3.6899 3.8279 3.8053 3.9061 3.8886 3.8896 4.1400 3.7069 3.9296 3.9360 3.8168 3.6110 4.0016 3.9469 3.6071 3.8168 3.6246 3.9375 3.9248 3.8880 3.9041 3.8910 1.0255 1.0319 1.0019 1.0026 0.9996 1.0023 1.0018 1.0162 1.0027 0.9962 1.0060 0.9963 0.9993 0.9984 1.0146 0.9919 1.0105 1.0051 0.9953 1.0085 1.0057 1.0030 1.0030 0.9902 0.9906 0.9895
dispcorr: -0.023173251 hartree
energy: -1079.762501403142
dipole: 25.32587 -24.70262 0.62325 8.73830 -9.69147 -0.95316 -6.34736 6.15779 -0.18957
magnitude: 1.15451 au
magnitude: 2.93453 debye
