program: Orca
programVersion: 5.0.2
elementType: O O O C C C C C C C C C C C C C C C C C C C C C C H H H H H H H H H H H H H H H H H H H H H H H H H H
charge: 0
multiplicity: 1
keywords: wb97x-d3
keywords: def2-TZVPP
keywords: def2/J RIJCOSX
keywords: DEFGRID2
keywords: scfconv7
keywords: smallprint printgap noloewdin
keywords: NOSOSCF
formula: C22H26O3
InChI: InChI=1/C22H26O3/c1-15(2)10-19-20(22(19,3)4)21(23)25-14-17-12-18(24-13-17)11-16-8-6-5-7-9-16/h5-10,12-13,19-20H,11,14H2,1-4H3
51 atoms
O  1.503613 -1.927377 -0.460357
O  0.774086 -0.703559 -2.189575
O  -2.237431 -3.318519 1.297692
C  1.243345 1.597037 -0.0908
C  2.306799 1.633989 -1.134153
C  2.018184 0.326102 -0.425139
C  1.516014 2.17309 1.277642
C  -0.200128 1.742951 -0.510733
C  3.615759 2.306458 -0.931136
C  1.370485 -0.785121 -1.137902
C  4.722346 2.023771 -1.62413
C  6.002897 2.765448 -1.394434
C  4.779981 0.964316 -2.681208
C  0.706485 -3.059487 -0.854887
C  -0.618491 -2.978491 -0.184223
C  -1.664028 -2.024394 -0.405878
C  -1.027178 -3.734609 0.861434
C  -2.614944 -2.268004 0.525406
C  -3.879307 -1.558786 0.868653
C  -3.601622 -0.127165 1.261474
C  -2.858835 0.153019 2.40797
C  -4.041731 0.930399 0.47382
C  -2.564195 1.461833 2.757709
C  -3.749539 2.244407 0.823076
C  -3.009739 2.513883 1.964698
H  1.929073 1.664638 -2.152944
H  2.729762 0.021688 0.333779
H  1.355343 3.253002 1.280251
H  2.533216 1.984715 1.620128
H  0.834209 1.738788 2.011752
H  -0.856009 1.139138 0.120125
H  -0.375029 1.465138 -1.54757
H  -0.506369 2.784715 -0.399222
H  3.660032 3.092852 -0.183136
H  6.800496 2.081508 -1.093455
H  6.344501 3.251085 -2.312176
H  5.904479 3.530305 -0.624542
H  3.881981 0.349765 -2.726121
H  4.926932 1.411668 -3.668062
H  5.632334 0.301233 -2.515673
H  1.255651 -3.934181 -0.51134
H  0.625314 -3.116524 -1.939981
H  -1.700272 -1.245407 -1.150438
H  -0.579591 -4.568955 1.378676
H  -4.378332 -2.084615 1.685408
H  -4.563869 -1.58108 0.018486
H  -2.505535 -0.660995 3.030748
H  -4.616774 0.726873 -0.421686
H  -1.987215 1.662675 3.65134
H  -4.099993 3.056348 0.198989
H  -2.779774 3.535736 2.236845
elementType: O C H
totalener: -1079.73742402 hartree
nucrepener: 2182.22066780 hartree
electener: -3261.95809182 hartree
oneelecener: -5803.99169501 hartree
twoeener: 2542.03360319 hartree
cpcmener: -0.02812016 hartree
kineticenergy: 1074.85035907 hartree
xcener: -106.461294528141 hartree
chargesum: 0.0000000
charge: -0.290038 -0.501088 -0.281664 0.215528 -0.045974 -0.095652 -0.305722 -0.281448 -0.290251 0.409773 -0.014660 -0.228040 -0.248048 0.076394 -0.090194 -0.325829 -0.033674 0.223098 -0.027109 -0.015388 -0.168022 -0.159632 -0.175377 -0.166951 -0.168257 0.103836 0.092035 0.102305 0.095430 0.095945 0.042703 0.104312 0.105035 0.126353 0.095528 0.095392 0.089628 0.080267 0.103416 0.094682 0.119353 0.119523 0.165392 0.179059 0.109706 0.103335 0.143881 0.142185 0.160249 0.159498 0.159175
qa: -0.2900 -0.5011 -0.2817 0.2155 -0.0460 -0.0957 -0.3057 -0.2814 -0.2903 0.4098 -0.0147 -0.2280 -0.2480 0.0764 -0.0902 -0.3258 -0.0337 0.2231 -0.0271 -0.0154 -0.1680 -0.1596 -0.1754 -0.1670 -0.1683 0.1038 0.0920 0.1023 0.0954 0.0959 0.0427 0.1043 0.1050 0.1264 0.0955 0.0954 0.0896 0.0803 0.1034 0.0947 0.1194 0.1195 0.1654 0.1791 0.1097 0.1033 0.1439 0.1422 0.1602 0.1595 0.1592
va: 2.1094 1.9907 2.2719 3.6228 3.8501 3.8209 3.9136 3.8883 3.8831 4.1366 3.7068 3.9280 3.9432 3.8361 3.7213 3.9510 3.9477 3.6449 3.7922 3.6835 3.8704 3.8758 3.8556 3.8680 3.8353 1.0232 1.0348 0.9982 1.0031 1.0035 1.0106 1.0209 1.0014 1.0028 0.9967 0.9951 1.0067 1.0143 0.9977 0.9997 0.9976 1.0113 1.0129 0.9924 1.0138 1.0072 1.0066 1.0025 0.9909 0.9906 0.9910
dispcorr: -0.026937123 hartree
energy: -1079.764361147759
dipole: 18.14062 -17.79262 0.34800 18.50742 -18.43507 0.07235 -3.24442 4.03443 0.79000
magnitude: 0.86628 au
magnitude: 2.20191 debye
