program: Orca
programVersion: 5.0.2
elementType: O O O C C C C C C C C C C C C C C C C C C C C C C H H H H H H H H H H H H H H H H H H H H H H H H H H
charge: 0
multiplicity: 1
keywords: wb97x-d3
keywords: def2-TZVPP
keywords: def2/J RIJCOSX
keywords: DEFGRID2
keywords: scfconv7
keywords: smallprint printgap noloewdin
keywords: NOSOSCF
formula: C22H26O3
InChI: InChI=1/C22H26O3/c1-15(2)10-19-20(22(19,3)4)21(23)25-14-17-12-18(24-13-17)11-16-8-6-5-7-9-16/h5-10,12-13,19-20H,11,14H2,1-4H3
51 atoms
O  1.036605 -1.182294 -0.169828
O  3.140008 -1.88154 0.104749
O  -3.114251 -2.531835 -0.020603
C  3.755206 0.63743 -1.684729
C  4.039877 0.958757 -0.249229
C  2.699013 0.357358 -0.629107
C  3.4325 1.752837 -2.649221
C  4.518154 -0.492124 -2.333173
C  4.074729 2.339761 0.271836
C  2.355744 -1.008715 -0.197927
C  5.017859 2.869422 1.058257
C  4.91038 4.287137 1.534496
C  6.233993 2.142129 1.545299
C  0.532578 -2.464147 0.246895
C  -0.938462 -2.331025 0.368838
C  -1.660006 -1.578737 1.352226
C  -1.875313 -2.881438 -0.435513
C  -2.973589 -1.734689 1.071281
C  -4.210916 -1.185671 1.679691
C  -4.909268 -0.216053 0.756301
C  -6.120366 -0.542131 0.156947
C  -4.330204 1.019732 0.475057
C  -6.746097 0.350747 -0.705547
C  -4.951955 1.912984 -0.38407
C  -6.164066 1.580178 -0.977971
H  4.71519 0.257677 0.229661
H  1.859301 1.043384 -0.642673
H  4.349944 2.224058 -3.007174
H  2.809043 2.529703 -2.20893
H  2.902303 1.360367 -3.518758
H  3.906088 -1.002125 -3.079551
H  4.877203 -1.23441 -1.624212
H  5.391931 -0.088655 -2.848103
H  3.240087 2.97522 -0.010408
H  5.759093 4.88241 1.188061
H  3.996113 4.770312 1.190492
H  4.927343 4.334964 2.626503
H  6.195229 2.011322 2.63025
H  6.370956 1.160026 1.096715
H  7.133941 2.726808 1.33951
H  0.978301 -2.742831 1.203426
H  0.797131 -3.226081 -0.48877
H  -1.246846 -0.999306 2.163101
H  -1.811511 -3.525102 -1.29913
H  -3.929346 -0.685331 2.607809
H  -4.892657 -1.995682 1.951282
H  -6.580974 -1.499978 0.367597
H  -3.383921 1.283514 0.933674
H  -7.689467 0.083317 -1.164072
H  -4.492179 2.871083 -0.589593
H  -6.65061 2.276613 -1.648356
elementType: O C H
totalener: -1079.74220567 hartree
nucrepener: 2016.95127206 hartree
electener: -3096.69347773 hartree
oneelecener: -5473.00808192 hartree
twoeener: 2376.31460419 hartree
cpcmener: -0.03197368 hartree
kineticenergy: 1074.85307417 hartree
xcener: -106.459316633665 hartree
chargesum: 0.0000000
charge: -0.279804 -0.508490 -0.287355 0.107557 0.045363 -0.094132 -0.269061 -0.279829 -0.287845 0.422634 -0.043123 -0.220315 -0.256546 0.083239 -0.088279 -0.317458 -0.026006 0.190806 -0.051502 0.025063 -0.186809 -0.192463 -0.160186 -0.165012 -0.173423 0.090283 0.089151 0.096914 0.089569 0.098282 0.100635 0.090327 0.096527 0.121441 0.094733 0.089471 0.092844 0.099597 0.091416 0.094283 0.113174 0.117745 0.166120 0.179557 0.118908 0.108686 0.143205 0.146827 0.160479 0.161093 0.161707
qa: -0.2798 -0.5085 -0.2874 0.1076 0.0454 -0.0941 -0.2691 -0.2798 -0.2878 0.4226 -0.0431 -0.2203 -0.2565 0.0832 -0.0883 -0.3175 -0.0260 0.1908 -0.0515 0.0251 -0.1868 -0.1925 -0.1602 -0.1650 -0.1734 0.0903 0.0892 0.0969 0.0896 0.0983 0.1006 0.0903 0.0965 0.1214 0.0947 0.0895 0.0928 0.0996 0.0914 0.0943 0.1132 0.1177 0.1661 0.1796 0.1189 0.1087 0.1432 0.1468 0.1605 0.1611 0.1617
va: 2.1202 1.9927 2.2640 3.6874 3.7566 3.8717 3.9111 3.9039 3.8799 4.1157 3.7469 3.9210 3.9428 3.8418 3.7380 3.9878 3.9443 3.6373 3.8157 3.6067 3.9400 3.9313 3.8903 3.9039 3.8918 1.0334 1.0358 1.0019 1.0057 1.0017 0.9987 1.0190 1.0003 1.0099 0.9963 1.0087 0.9958 0.9957 1.0086 0.9976 0.9950 0.9994 1.0060 0.9937 1.0059 1.0079 1.0034 1.0024 0.9899 0.9902 0.9892
dispcorr: -0.020943316 hartree
energy: -1079.763148983728
dipole: 27.21581 -27.62458 -0.40877 18.50135 -17.62373 0.87762 -2.38845 2.44523 0.05679
magnitude: 0.96982 au
magnitude: 2.46508 debye
