program: Orca
programVersion: 5.0.2
elementType: O O O C C C C C C C C C C C C C C C C C C C C C C H H H H H H H H H H H H H H H H H H H H H H H H H H
charge: 0
multiplicity: 1
keywords: wb97x-d3
keywords: def2-TZVPP
keywords: def2/J RIJCOSX
keywords: DEFGRID2
keywords: scfconv7
keywords: smallprint printgap noloewdin
keywords: NOSOSCF
formula: C22H26O3
InChI: InChI=1/C22H26O3/c1-15(2)10-19-20(22(19,3)4)21(23)25-14-17-12-18(24-13-17)11-16-8-6-5-7-9-16/h5-10,12-13,19-20H,11,14H2,1-4H3
51 atoms
O  2.193581 2.033458 -0.002606
O  1.794752 0.283422 1.335163
O  -1.998907 3.285659 -0.815284
C  4.238477 -1.021615 -0.077622
C  3.039726 -1.406161 -0.873646
C  3.282412 0.064738 -0.529615
C  4.347872 -1.40739 1.377306
C  5.572152 -1.031586 -0.788373
C  1.918809 -2.180181 -0.288224
C  2.355166 0.760883 0.383689
C  0.664597 -2.177531 -0.73791
C  -0.393984 -3.00631 -0.079857
C  0.197482 -1.331191 -1.881235
C  1.277346 2.839655 0.739316
C  -0.107312 2.738229 0.205945
C  -1.020724 1.636425 0.293757
C  -0.764408 3.699883 -0.480878
C  -2.148849 2.026433 -0.345687
C  -3.460926 1.380809 -0.629573
C  -3.60742 0.011996 -0.022399
C  -3.611056 -0.156152 1.360171
C  -3.78698 -1.106259 -0.828128
C  -3.793554 -1.410283 1.920156
C  -3.98126 -2.3625 -0.270874
C  -3.985659 -2.517991 1.105735
H  3.232393 -1.617449 -1.92256
H  3.635602 0.683704 -1.346183
H  5.023896 -0.727608 1.898927
H  3.39833 -1.392935 1.902996
H  4.76775 -2.41204 1.459245
H  6.270102 -0.333703 -0.322805
H  6.019613 -2.026374 -0.748332
H  5.478752 -0.755079 -1.839391
H  2.153673 -2.807098 0.565298
H  -0.888595 -3.664362 -0.798825
H  -1.175709 -2.373175 0.345965
H  0.011029 -3.623867 0.720817
H  -0.274466 -1.944365 -2.652547
H  0.998601 -0.761261 -2.3471
H  -0.559196 -0.618643 -1.543804
H  1.64396 3.86085 0.633159
H  1.309831 2.577367 1.797718
H  -0.843892 0.687991 0.773754
H  -0.485699 4.695588 -0.787282
H  -3.606226 1.31688 -1.712357
H  -4.265053 2.028385 -0.26266
H  -3.470619 0.703883 2.003834
H  -3.782393 -0.993886 -1.905844
H  -3.792216 -1.523148 2.996312
H  -4.123692 -3.22013 -0.915196
H  -4.134145 -3.496292 1.543161
totalener: -1079.72902649 hartree
nucrepener: 2217.59154752 hartree
electener: -3297.32057401 hartree
oneelecener: -5873.83250521 hartree
twoeener: 2576.51193120 hartree
kineticenergy: 1074.91932261 hartree
xcener: -106.472712369300 hartree
chargesum: -0.0000000
charge: -0.266464 -0.395630 -0.258121 0.138179 -0.063829 -0.106672 -0.288736 -0.242074 -0.135317 0.362131 -0.015743 -0.188969 -0.238064 0.063884 -0.055387 -0.307983 -0.045302 0.225312 -0.061401 0.068456 -0.222211 -0.176160 -0.071925 -0.117202 -0.152912 0.092166 0.081696 0.084344 0.107307 0.088192 0.089574 0.087011 0.070480 0.080035 0.079243 0.056557 0.079217 0.094224 0.088476 0.062813 0.090856 0.110677 0.177619 0.133333 0.087010 0.107415 0.125814 0.106488 0.126438 0.121682 0.123474
qa: -0.2665 -0.3956 -0.2581 0.1382 -0.0638 -0.1067 -0.2887 -0.2421 -0.1353 0.3621 -0.0157 -0.1890 -0.2381 0.0639 -0.0554 -0.3080 -0.0453 0.2253 -0.0614 0.0685 -0.2222 -0.1762 -0.0719 -0.1172 -0.1529 0.0922 0.0817 0.0843 0.1073 0.0882 0.0896 0.0870 0.0705 0.0800 0.0792 0.0566 0.0792 0.0942 0.0885 0.0628 0.0909 0.1107 0.1776 0.1333 0.0870 0.1074 0.1258 0.1065 0.1264 0.1217 0.1235
va: 2.1250 2.0827 2.3036 3.7306 3.9018 3.8513 3.9132 3.9025 3.8582 4.1359 3.7499 3.9575 3.9419 3.9130 3.7675 3.9728 4.0100 3.6316 3.8518 3.5880 3.9995 3.9418 3.8947 3.8967 3.9478 1.0047 1.0317 1.0047 1.0191 0.9978 1.0051 1.0045 1.0076 1.0111 0.9997 1.0001 1.0173 1.0030 1.0128 1.0151 0.9963 1.0096 1.0002 1.0091 1.0137 1.0024 1.0065 1.0134 0.9990 1.0031 1.0021
dispcorr: -0.028199013 hartree
energy: -1079.757225501466
dipole: 11.85256 -11.87089 -0.01833 -16.57308 16.66922 0.09615 -2.33350 1.97250 -0.36099
magnitude: 0.37402 au
magnitude: 0.95069 debye
