program: Orca
programVersion: 5.0.2
elementType: O O O C C C C C C C C C C C C C C C C C C C C C C H H H H H H H H H H H H H H H H H H H H H H H H H H
charge: 0
multiplicity: 1
keywords: wb97x-d3
keywords: def2-TZVPP
keywords: def2/J RIJCOSX
keywords: DEFGRID2
keywords: scfconv7
keywords: smallprint printgap noloewdin
keywords: NOSOSCF
formula: C22H26O3
InChI: InChI=1/C22H26O3/c1-15(2)10-19-20(22(19,3)4)21(23)25-14-17-12-18(24-13-17)11-16-8-6-5-7-9-16/h5-10,12-13,19-20H,11,14H2,1-4H3
51 atoms
O  2.321639 1.606198 0.267815
O  2.134895 2.019666 -1.919532
O  -1.856615 1.957161 1.337384
C  3.505448 -1.081878 -0.272628
C  2.109583 -1.308703 -0.774002
C  2.907859 -0.105715 -1.258967
C  3.753929 -0.7425 1.177428
C  4.584781 -1.969583 -0.852645
C  0.895408 -1.147083 0.070051
C  2.425441 1.27543 -1.01879
C  0.498794 -2.01443 1.002337
C  -0.76691 -1.801969 1.773894
C  1.26296 -3.253875 1.3557
C  1.618164 2.81064 0.593691
C  0.152701 2.556718 0.611213
C  -0.734158 2.441484 -0.507476
C  -0.595223 2.250939 1.697056
C  -1.934437 2.066102 -0.007108
C  -3.209853 1.656896 -0.64972
C  -3.383074 0.155193 -0.604549
C  -2.541912 -0.663274 -1.352575
C  -4.343779 -0.435027 0.205777
C  -2.659663 -2.041525 -1.293879
C  -4.466778 -1.816715 0.265846
C  -3.625547 -2.623172 -0.484077
H  2.017033 -2.081134 -1.534997
H  3.27255 -0.194046 -2.276073
H  4.007885 -1.657488 1.716744
H  4.597461 -0.058344 1.280089
H  2.893458 -0.301308 1.669344
H  5.561736 -1.485867 -0.798811
H  4.64942 -2.908276 -0.29817
H  4.395746 -2.217005 -1.898259
H  0.259709 -0.289065 -0.123542
H  -1.283151 -0.891153 1.475644
H  -0.563421 -1.744021 2.846667
H  -1.460514 -2.633261 1.628861
H  0.641634 -4.142067 1.214569
H  1.551316 -3.244647 2.409882
H  2.166777 -3.380442 0.762631
H  1.882605 3.61065 -0.098141
H  1.974019 3.085112 1.586047
H  -0.490731 2.602538 -1.544816
H  -0.364984 2.200106 2.749268
H  -3.194268 2.002863 -1.685093
H  -4.05937 2.148198 -0.168561
H  -1.775806 -0.216698 -1.975864
H  -5.001025 0.189314 0.799071
H  -1.990731 -2.66249 -1.874708
H  -5.220002 -2.262015 0.902704
H  -3.717987 -3.700309 -0.435952
totalener: -1079.72428893 hartree
nucrepener: 2280.28753696 hartree
electener: -3360.01182590 hartree
oneelecener: -5998.94937605 hartree
twoeener: 2638.93755015 hartree
kineticenergy: 1074.91693823 hartree
xcener: -106.471285289806 hartree
chargesum: 0.0000000
charge: -0.248932 -0.377828 -0.247054 0.101080 -0.044638 -0.095074 -0.247811 -0.249941 -0.137079 0.330849 -0.024796 -0.225092 -0.252747 0.027147 -0.050536 -0.262723 -0.035747 0.205700 -0.112508 0.057316 -0.180758 -0.129758 -0.104808 -0.106083 -0.164540 0.091025 0.085432 0.078527 0.098989 0.093907 0.094266 0.081019 0.073693 0.058086 0.070312 0.096994 0.087815 0.097001 0.091510 0.079171 0.120731 0.091066 0.151668 0.133105 0.112328 0.094904 0.120599 0.104622 0.120426 0.123619 0.125543
qa: -0.2489 -0.3778 -0.2471 0.1011 -0.0446 -0.0951 -0.2478 -0.2499 -0.1371 0.3308 -0.0248 -0.2251 -0.2527 0.0271 -0.0505 -0.2627 -0.0357 0.2057 -0.1125 0.0573 -0.1808 -0.1298 -0.1048 -0.1061 -0.1645 0.0910 0.0854 0.0785 0.0990 0.0939 0.0943 0.0810 0.0737 0.0581 0.0703 0.0970 0.0878 0.0970 0.0915 0.0792 0.1207 0.0911 0.1517 0.1331 0.1123 0.0949 0.1206 0.1046 0.1204 0.1236 0.1255
va: 2.1094 2.1187 2.2981 3.6713 3.8213 3.8571 3.8875 3.9087 3.8559 4.2397 3.6616 3.9388 3.9280 3.9083 3.6605 3.9887 3.9589 3.6202 3.8681 3.6138 3.9360 3.9889 3.9007 3.9337 3.9208 1.0059 1.0272 1.0003 1.0085 1.0155 1.0038 1.0067 1.0080 0.9945 1.0123 1.0043 1.0020 1.0035 0.9982 1.0098 1.0057 1.0006 1.0219 1.0074 1.0073 1.0151 1.0084 1.0119 1.0034 0.9998 1.0001
dispcorr: -0.031456838 hartree
energy: -1079.755745770539
dipole: 10.28020 -10.39224 -0.11204 -18.85146 18.28025 -0.57121 6.11563 -5.41299 0.70264
magnitude: 0.91244 au
magnitude: 2.31923 debye
