program: Orca
programVersion: 5.0.2
elementType: O O O C C C C C C C C C C C C C C C C C C C C C C H H H H H H H H H H H H H H H H H H H H H H H H H H
charge: 0
multiplicity: 1
keywords: wb97x-d3
keywords: def2-TZVPP
keywords: def2/J RIJCOSX
keywords: DEFGRID2
keywords: scfconv7
keywords: smallprint printgap noloewdin
keywords: NOSOSCF
formula: C22H26O3
InChI: InChI=1/C22H26O3/c1-15(2)10-19-20(22(19,3)4)21(23)25-14-17-12-18(24-13-17)11-16-8-6-5-7-9-16/h5-10,12-13,19-20H,11,14H2,1-4H3
51 atoms
O  1.882724 2.089214 -0.361157
O  1.095088 0.27221 -1.397014
O  -2.018785 3.760032 0.86202
C  2.189946 -1.103441 1.212021
C  3.241576 -1.338422 0.169622
C  2.697254 0.065632 0.38504
C  0.793577 -1.640299 1.014668
C  2.631339 -1.116689 2.656083
C  3.003951 -2.133087 -1.050589
C  1.810632 0.770099 -0.565635
C  3.749641 -3.162281 -1.461924
C  3.403672 -3.898631 -2.722766
C  4.962369 -3.693543 -0.757637
C  0.96579 2.923556 -1.076398
C  -0.350536 2.99636 -0.386679
C  -1.37131 1.993483 -0.307821
C  -0.808557 4.037653 0.346069
C  -2.353634 2.511821 0.465159
C  -3.666121 1.984426 0.931379
C  -3.813506 0.51855 0.626234
C  -3.099366 -0.424352 1.360214
C  -4.639971 0.078939 -0.399401
C  -3.210251 -1.775411 1.076092
C  -4.756816 -1.274449 -0.686061
C  -4.042271 -2.204826 0.051071
H  4.242752 -1.43601 0.575528
H  3.364435 0.737205 0.912628
H  0.47221 -1.658545 -0.021889
H  0.740932 -2.661963 1.395111
H  0.070973 -1.039588 1.570673
H  2.621302 -2.134632 3.050605
H  3.642401 -0.725776 2.779183
H  1.965655 -0.512439 3.275471
H  2.150588 -1.858072 -1.656433
H  4.225386 -3.852744 -3.442435
H  2.51518 -3.492489 -3.203829
H  3.224407 -4.958444 -2.523715
H  5.837194 -3.655541 -1.412506
H  4.820136 -4.745091 -0.494143
H  5.212907 -3.162873 0.158452
H  0.858014 2.578117 -2.105492
H  1.436477 3.906309 -1.096491
H  -1.362662 1.019428 -0.766574
H  -0.390889 5.004617 0.577873
H  -4.482539 2.546319 0.466807
H  -3.762163 2.152642 2.008932
H  -2.445022 -0.093912 2.158391
H  -5.19772 0.801449 -0.983189
H  -2.646065 -2.495027 1.655018
H  -5.406113 -1.600045 -1.488063
H  -4.131563 -3.259933 -0.17119
totalener: -1079.72996037 hartree
nucrepener: 2149.19237922 hartree
electener: -3228.92233959 hartree
oneelecener: -5736.86398882 hartree
twoeener: 2507.94164924 hartree
kineticenergy: 1074.89980300 hartree
xcener: -106.467453105665 hartree
chargesum: 0.0000000
charge: -0.262517 -0.411775 -0.256550 0.116354 0.015208 -0.088404 -0.272447 -0.242478 -0.219640 0.367939 -0.042542 -0.208245 -0.242782 0.064615 -0.083668 -0.237291 -0.038803 0.181598 -0.063157 0.029482 -0.184226 -0.137522 -0.113985 -0.123592 -0.125012 0.086829 0.081514 0.105762 0.088806 0.074865 0.087408 0.071105 0.088446 0.114416 0.081832 0.082022 0.079988 0.086754 0.084977 0.075817 0.113620 0.092579 0.164452 0.134734 0.086256 0.101278 0.117256 0.106812 0.123539 0.123467 0.124909
qa: -0.2625 -0.4118 -0.2566 0.1164 0.0152 -0.0884 -0.2724 -0.2425 -0.2196 0.3679 -0.0425 -0.2082 -0.2428 0.0646 -0.0837 -0.2373 -0.0388 0.1816 -0.0632 0.0295 -0.1842 -0.1375 -0.1140 -0.1236 -0.1250 0.0868 0.0815 0.1058 0.0888 0.0749 0.0874 0.0711 0.0884 0.1144 0.0818 0.0820 0.0800 0.0868 0.0850 0.0758 0.1136 0.0926 0.1645 0.1347 0.0863 0.1013 0.1173 0.1068 0.1235 0.1235 0.1249
va: 2.1333 2.0677 2.3022 3.7438 3.8051 3.9114 3.9289 3.9072 3.8910 4.1407 3.7904 3.9401 3.9468 3.8984 3.7640 3.9597 3.9976 3.6622 3.8563 3.6666 3.9713 3.9816 3.9319 3.9709 3.9658 1.0101 1.0309 1.0164 1.0042 1.0054 1.0035 1.0090 1.0044 1.0286 0.9979 1.0122 0.9983 0.9987 0.9996 1.0159 1.0077 0.9963 1.0102 1.0082 1.0096 1.0060 1.0065 1.0115 1.0003 1.0007 0.9995
dispcorr: -0.024437877 hartree
energy: -1079.754398246621
dipole: 16.42580 -16.21653 0.20927 -23.16343 23.14020 -0.02323 1.31456 -0.86726 0.44731
magnitude: 0.49438 au
magnitude: 1.25662 debye
