program: Orca
programVersion: 5.0.2
elementType: O O O C C C C C C C C C C C C C C C C C C C C C C H H H H H H H H H H H H H H H H H H H H H H H H H H
charge: 0
multiplicity: 1
keywords: wb97x-d3
keywords: def2-TZVPP
keywords: def2/J RIJCOSX
keywords: DEFGRID2
keywords: scfconv7
keywords: smallprint printgap noloewdin
keywords: NOSOSCF
formula: C22H26O3
InChI: InChI=1/C22H26O3/c1-15(2)10-19-20(22(19,3)4)21(23)25-14-17-12-18(24-13-17)11-16-8-6-5-7-9-16/h5-10,12-13,19-20H,11,14H2,1-4H3
51 atoms
O  1.667751 1.414807 -1.293992
O  2.819695 1.584144 0.612987
O  -1.22605 1.180795 2.001569
C  4.710174 -0.589495 -0.458409
C  3.47835 -1.372648 -0.148467
C  3.388571 -0.09998 -0.998776
C  5.456064 0.14711 0.627851
C  5.637109 -1.17041 -1.502966
C  2.87654 -1.433123 1.206508
C  2.63857 1.047991 -0.448203
C  1.594882 -1.711857 1.448868
C  1.057654 -1.778046 2.845838
C  0.585736 -1.95352 0.368175
C  0.753213 2.409368 -0.824326
C  -0.245871 1.847445 0.127158
C  -1.504094 1.241029 -0.191518
C  -0.139182 1.774462 1.474907
C  -2.055371 0.857403 0.983998
C  -3.330204 0.175816 1.340575
C  -4.152007 -0.124792 0.118025
C  -3.974077 -1.313842 -0.579776
C  -5.080064 0.796053 -0.354775
C  -4.713995 -1.582232 -1.721613
C  -5.821051 0.532725 -1.496952
C  -5.639886 -0.658562 -2.183589
H  3.347314 -2.276348 -0.738051
H  3.216529 -0.265813 -2.056363
H  6.01291 0.984434 0.204253
H  4.81526 0.546376 1.406851
H  6.17954 -0.527745 1.089963
H  6.205178 -0.383086 -2.002062
H  6.351171 -1.856925 -1.044126
H  5.094348 -1.724924 -2.270487
H  3.533304 -1.247403 2.049758
H  0.247152 -1.05846 2.984322
H  1.82427 -1.568459 3.590743
H  0.640024 -2.765094 3.061609
H  0.092501 -2.919895 0.50451
H  1.013855 -1.931524 -0.631687
H  -0.197369 -1.191641 0.400068
H  0.257407 2.775072 -1.722739
H  1.294258 3.243228 -0.374738
H  -1.937277 1.109476 -1.170104
H  0.635175 2.075697 2.160117
H  -3.90347 0.800902 2.031743
H  -3.113694 -0.750525 1.881902
H  -3.249177 -2.037423 -0.22541
H  -5.223524 1.729382 0.176563
H  -4.569162 -2.514969 -2.250664
H  -6.542466 1.258253 -1.849501
H  -6.220134 -0.867641 -3.072539
totalener: -1079.72937025 hartree
nucrepener: 2188.70219916 hartree
electener: -3268.43156941 hartree
oneelecener: -5815.84886660 hartree
twoeener: 2547.41729719 hartree
kineticenergy: 1074.91093923 hartree
xcener: -106.469798334033 hartree
chargesum: -0.0000000
charge: -0.265264 -0.396461 -0.262144 0.145432 -0.061452 -0.109029 -0.274996 -0.245891 -0.175041 0.361874 -0.004324 -0.215951 -0.228843 0.053197 -0.081623 -0.223469 0.008649 0.140070 -0.051443 0.031625 -0.158844 -0.155112 -0.125668 -0.123775 -0.127001 0.088952 0.079695 0.085256 0.100778 0.086315 0.090476 0.087701 0.069710 0.084037 0.080699 0.079298 0.086096 0.095086 0.085877 0.061361 0.100397 0.113190 0.135057 0.150416 0.095645 0.095593 0.107911 0.110277 0.124810 0.124934 0.125918
qa: -0.2653 -0.3965 -0.2621 0.1454 -0.0615 -0.1090 -0.2750 -0.2459 -0.1750 0.3619 -0.0043 -0.2160 -0.2288 0.0532 -0.0816 -0.2235 0.0086 0.1401 -0.0514 0.0316 -0.1588 -0.1551 -0.1257 -0.1238 -0.1270 0.0890 0.0797 0.0853 0.1008 0.0863 0.0905 0.0877 0.0697 0.0840 0.0807 0.0793 0.0861 0.0951 0.0859 0.0614 0.1004 0.1132 0.1351 0.1504 0.0956 0.0956 0.1079 0.1103 0.1248 0.1249 0.1259
va: 2.1210 2.0882 2.2817 3.7400 3.8909 3.8381 3.9055 3.9027 3.8804 4.1718 3.7437 3.9342 3.9510 3.8810 3.6516 3.9428 3.9307 3.6709 3.8521 3.6507 3.9835 3.9874 3.9704 3.9606 3.9526 1.0060 1.0319 1.0054 1.0219 0.9977 1.0049 1.0048 1.0068 1.0133 1.0088 1.0117 0.9986 1.0037 1.0137 1.0043 0.9938 1.0090 1.0108 1.0174 1.0088 1.0063 1.0119 1.0112 1.0004 1.0004 0.9995
dispcorr: -0.027419344 hartree
energy: -1079.756789592299
dipole: 13.84167 -14.32293 -0.48126 -12.03557 11.71173 -0.32385 0.65941 -1.20997 -0.55055
magnitude: 0.79975 au
magnitude: 2.03280 debye
