program: Orca
programVersion: 5.0.2
elementType: O O O C C C C C C C C C C C C C C C C C C C C C C H H H H H H H H H H H H H H H H H H H H H H H H H H
charge: 0
multiplicity: 1
keywords: wb97x-d3
keywords: def2-TZVPP
keywords: def2/J RIJCOSX
keywords: DEFGRID2
keywords: scfconv7
keywords: smallprint printgap noloewdin
keywords: NOSOSCF
formula: C22H26O3
InChI: InChI=1/C22H26O3/c1-15(2)10-19-20(22(19,3)4)21(23)25-14-17-12-18(24-13-17)11-16-8-6-5-7-9-16/h5-10,12-13,19-20H,11,14H2,1-4H3
51 atoms
O  2.35191 1.380019 0.2641
O  2.008811 1.515588 -1.937552
O  -1.887221 1.980448 1.381647
C  4.159931 -0.996484 -0.182779
C  2.785686 -1.574308 -0.214032
C  3.133317 -0.379123 -1.108601
C  4.676496 -0.288364 1.046574
C  5.248568 -1.772681 -0.891279
C  1.83758 -1.475379 0.920465
C  2.451435 0.926838 -0.983306
C  0.515885 -1.591171 0.7881
C  -0.397713 -1.545001 1.971825
C  -0.136559 -1.765917 -0.555536
C  1.605076 2.579203 0.4813
C  0.140665 2.325047 0.547981
C  -0.781258 2.128794 -0.530023
C  -0.597552 2.221789 1.677414
C  -1.993246 1.921662 0.034174
C  -3.333422 1.610872 -0.532709
C  -3.659995 0.135515 -0.490689
C  -3.691693 -0.614676 -1.660132
C  -3.914449 -0.504678 0.718935
C  -3.967364 -1.97443 -1.626648
C  -4.183816 -1.863762 0.756966
C  -4.210223 -2.604548 -0.416471
H  2.682814 -2.490901 -0.791475
H  3.261866 -0.624954 -2.156318
H  5.180113 -1.010432 1.692496
H  5.410955 0.470122 0.770726
H  3.904564 0.198184 1.633059
H  4.873892 -2.289992 -1.77534
H  6.055299 -1.111115 -1.212346
H  5.678444 -2.524896 -0.2272
H  2.25528 -1.337821 1.91225
H  0.146836 -1.411314 2.90623
H  -0.984069 -2.464468 2.048112
H  -1.117818 -0.730015 1.873739
H  0.106915 -0.941586 -1.228389
H  -1.222045 -1.808192 -0.47494
H  0.191767 -2.68531 -1.046513
H  1.841055 3.318407 -0.285493
H  1.964009 2.959143 1.437528
H  -0.553198 2.135693 -1.58265
H  -0.344353 2.30125 2.722561
H  -3.352785 1.96032 -1.565845
H  -4.101342 2.179232 -0.000116
H  -3.496056 -0.132541 -2.610537
H  -3.898366 0.062769 1.641406
H  -3.988854 -2.541325 -2.548197
H  -4.376316 -2.345734 1.706704
H  -4.421959 -3.665181 -0.386807
totalener: -1079.72508299 hartree
nucrepener: 2258.47697970 hartree
electener: -3338.20206269 hartree
oneelecener: -5955.46840265 hartree
twoeener: 2617.26633996 hartree
kineticenergy: 1074.91061049 hartree
xcener: -106.469539043308 hartree
chargesum: -0.0000000
charge: -0.245208 -0.388607 -0.261586 0.144165 -0.053427 -0.124964 -0.270532 -0.248468 -0.165469 0.351746 0.001753 -0.226267 -0.224062 0.028094 0.013012 -0.312124 -0.064083 0.253922 -0.117927 0.091688 -0.164234 -0.208038 -0.114337 -0.123339 -0.121808 0.088182 0.083716 0.088010 0.090968 0.084567 0.071992 0.090932 0.086225 0.082456 0.082454 0.097860 0.073937 0.093695 0.048457 0.097200 0.118078 0.086234 0.152072 0.132723 0.089841 0.110792 0.104889 0.121368 0.122907 0.125704 0.124842
qa: -0.2452 -0.3886 -0.2616 0.1442 -0.0534 -0.1250 -0.2705 -0.2485 -0.1655 0.3517 0.0018 -0.2263 -0.2241 0.0281 0.0130 -0.3121 -0.0641 0.2539 -0.1179 0.0917 -0.1642 -0.2080 -0.1143 -0.1233 -0.1218 0.0882 0.0837 0.0880 0.0910 0.0846 0.0720 0.0909 0.0862 0.0825 0.0825 0.0979 0.0739 0.0937 0.0485 0.0972 0.1181 0.0862 0.1521 0.1327 0.0898 0.1108 0.1049 0.1214 0.1229 0.1257 0.1248
va: 2.1041 2.1101 2.2847 3.7323 3.8521 3.8459 3.9081 3.9072 3.8164 4.2006 3.7183 3.9225 3.9616 3.9145 3.6209 3.9995 3.9608 3.5570 3.8575 3.6130 3.9721 3.9436 3.9354 3.9157 3.9292 1.0077 1.0313 0.9994 1.0048 1.0186 1.0088 1.0042 1.0045 1.0116 1.0154 1.0003 0.9968 1.0079 1.0200 1.0063 1.0040 1.0010 1.0237 1.0081 1.0147 1.0066 1.0127 1.0210 1.0015 1.0011 0.9997
dispcorr: -0.030611136 hartree
energy: -1079.755694126301
dipole: 11.04155 -11.12113 -0.07958 -13.71179 13.40214 -0.30965 2.67076 -2.11989 0.55088
magnitude: 0.63693 au
magnitude: 1.61895 debye
