program: Orca
programVersion: 5.0.2
elementType: O O O C C C C C C C C C C C C C C C C C C C C C C H H H H H H H H H H H H H H H H H H H H H H H H H H
charge: 0
multiplicity: 1
keywords: wb97x-d3
keywords: def2-TZVPP
keywords: def2/J RIJCOSX
keywords: DEFGRID2
keywords: scfconv7
keywords: smallprint printgap noloewdin
keywords: NOSOSCF
formula: C22H26O3
InChI: InChI=1/C22H26O3/c1-15(2)10-19-20(22(19,3)4)21(23)25-14-17-12-18(24-13-17)11-16-8-6-5-7-9-16/h5-10,12-13,19-20H,11,14H2,1-4H3
51 atoms
O  1.645643 0.98425 -1.587922
O  2.775411 1.606933 0.239414
O  -1.321917 1.358059 1.574679
C  4.657733 -0.787988 -0.284507
C  3.44881 -1.409577 0.326347
C  3.304035 -0.455081 -0.867303
C  5.467101 0.234313 0.475654
C  5.515596 -1.681328 -1.152229
C  2.946355 -1.053637 1.673105
C  2.593118 0.821389 -0.653493
C  1.682133 -1.238626 2.054547
C  1.222523 -0.907439 3.439601
C  0.640834 -1.771394 1.108423
C  0.721825 2.057099 -1.382537
C  -0.304065 1.690059 -0.36741
C  -1.528663 0.984355 -0.594996
C  -0.238752 1.882416 0.971357
C  -2.103656 0.810549 0.617802
C  -3.360071 0.145981 1.061825
C  -4.226377 -0.219793 -0.111937
C  -4.162779 -1.487116 -0.678217
C  -5.081674 0.7224 -0.674089
C  -4.940412 -1.810481 -1.781351
C  -5.860522 0.403909 -1.775226
C  -5.791661 -0.865191 -2.33235
H  3.265387 -2.444132 0.043708
H  3.065611 -0.932281 -1.810915
H  4.868904 0.875085 1.115127
H  6.206737 -0.27594 1.096137
H  6.009621 0.879053 -0.217803
H  6.054323 -1.099706 -1.902184
H  6.254308 -2.208521 -0.545671
H  4.924514 -2.433323 -1.676837
H  3.655583 -0.641913 2.382782
H  0.831793 -1.79426 3.945738
H  0.408603 -0.178642 3.414406
H  2.025359 -0.49833 4.05169
H  0.50425 -1.111994 0.249289
H  -0.329797 -1.870651 1.594336
H  0.911076 -2.754414 0.715907
H  0.258178 2.216546 -2.355319
H  1.247899 2.970937 -1.104164
H  -1.926288 0.654921 -1.541411
H  0.501894 2.342355 1.603854
H  -3.907048 0.807811 1.74011
H  -3.122269 -0.750484 1.644236
H  -3.497106 -2.228853 -0.252821
H  -5.134642 1.716344 -0.245916
H  -4.882307 -2.802679 -2.209256
H  -6.523481 1.14711 -2.198524
H  -6.400531 -1.115847 -3.190879
totalener: -1079.72774496 hartree
nucrepener: 2183.64356337 hartree
electener: -3263.37130833 hartree
oneelecener: -5805.75167670 hartree
twoeener: 2542.38036837 hartree
kineticenergy: 1074.90781581 hartree
xcener: -106.468077858671 hartree
chargesum: 0.0000000
charge: -0.267455 -0.393236 -0.260656 0.135074 -0.046997 -0.094633 -0.277509 -0.244711 -0.168379 0.340283 0.008479 -0.216350 -0.277343 0.055886 -0.087635 -0.240782 0.007025 0.153867 -0.053771 0.024668 -0.148610 -0.155377 -0.129432 -0.124413 -0.124659 0.086717 0.078423 0.103174 0.086822 0.085099 0.090462 0.087631 0.069620 0.082359 0.090999 0.084093 0.076847 0.096795 0.078882 0.100836 0.100242 0.114171 0.134109 0.153317 0.100592 0.087950 0.109380 0.111715 0.124936 0.125404 0.126093
qa: -0.2675 -0.3932 -0.2607 0.1351 -0.0470 -0.0946 -0.2775 -0.2447 -0.1684 0.3403 0.0085 -0.2164 -0.2773 0.0559 -0.0876 -0.2408 0.0070 0.1539 -0.0538 0.0247 -0.1486 -0.1554 -0.1294 -0.1244 -0.1247 0.0867 0.0784 0.1032 0.0868 0.0851 0.0905 0.0876 0.0696 0.0824 0.0910 0.0841 0.0768 0.0968 0.0789 0.1008 0.1002 0.1142 0.1341 0.1533 0.1006 0.0879 0.1094 0.1117 0.1249 0.1254 0.1261
va: 2.1134 2.0856 2.2800 3.7598 3.8740 3.8350 3.9043 3.9003 3.8492 4.1759 3.7054 3.9243 3.9698 3.8836 3.6684 3.9644 3.9275 3.6618 3.8537 3.6625 3.9723 3.9885 3.9698 3.9597 3.9498 1.0077 1.0340 1.0216 0.9978 1.0051 1.0051 1.0049 1.0076 1.0131 0.9957 1.0040 1.0125 1.0012 1.0088 1.0039 0.9932 1.0100 1.0103 1.0150 1.0096 1.0056 1.0112 1.0104 1.0005 1.0003 0.9995
dispcorr: -0.027391772 hartree
energy: -1079.755136736260
dipole: 14.36268 -14.82421 -0.46153 -11.07053 10.58500 -0.48553 4.30667 -4.74730 -0.44064
magnitude: 0.80182 au
magnitude: 2.03805 debye
