program: Orca
programVersion: 5.0.2
elementType: O O O C C C C C C C C C C C C C C C C C C C C C C H H H H H H H H H H H H H H H H H H H H H H H H H H
charge: 0
multiplicity: 1
keywords: wb97x-d3
keywords: def2-TZVPP
keywords: def2/J RIJCOSX
keywords: DEFGRID2
keywords: scfconv7
keywords: smallprint printgap noloewdin
keywords: NOSOSCF
formula: C22H26O3
InChI: InChI=1/C22H26O3/c1-15(2)10-19-20(22(19,3)4)21(23)25-14-17-12-18(24-13-17)11-16-8-6-5-7-9-16/h5-10,12-13,19-20H,11,14H2,1-4H3
51 atoms
O  2.16349 1.974448 0.385656
O  2.232452 0.03041 1.488685
O  -2.124303 1.608363 -0.755786
C  4.93797 -0.489895 0.111416
C  3.932066 -0.826741 -0.935865
C  3.856715 0.518644 -0.205069
C  4.969455 -1.233195 1.424886
C  6.318174 -0.107228 -0.372585
C  2.892959 -1.868328 -0.750423
C  2.690615 0.776354 0.663254
C  1.742171 -1.916214 -1.422276
C  0.759136 -3.024844 -1.203147
C  1.320922 -0.879961 -2.418223
C  0.960102 2.336422 1.067948
C  -0.251003 1.754456 0.427608
C  -0.730091 0.404629 0.4726
C  -1.144898 2.426605 -0.335144
C  -1.865407 0.37736 -0.26336
C  -2.839238 -0.701185 -0.577901
C  -4.172484 -0.488834 0.097589
C  -5.197183 0.196252 -0.544413
C  -4.383373 -0.950207 1.392356
C  -6.41001 0.41337 0.092921
C  -5.594659 -0.738195 2.031433
C  -6.612714 -0.054482 1.382434
H  4.280872 -0.720677 -1.959839
H  4.16744 1.378988 -0.78655
H  5.419579 -0.611564 2.20065
H  3.989728 -1.536045 1.778964
H  5.588526 -2.126686 1.321046
H  6.935793 -0.996928 -0.508808
H  6.287398 0.420772 -1.326764
H  6.820551 0.539885 0.348623
H  3.101514 -2.650475 -0.028189
H  0.57339 -3.577341 -2.127693
H  -0.206882 -2.627622 -0.879284
H  1.099948 -3.73419 -0.450072
H  0.390519 -0.405103 -2.0964
H  1.12532 -1.331634 -3.394171
H  2.05774 -0.090815 -2.55323
H  0.924843 3.424368 1.013203
H  1.019949 2.053659 2.120169
H  -0.275608 -0.426347 0.985596
H  -1.206747 3.457887 -0.644356
H  -2.403387 -1.648074 -0.253763
H  -2.97713 -0.779178 -1.660386
H  -5.045759 0.565003 -1.551778
H  -3.589405 -1.479373 1.906392
H  -7.198965 0.947806 -0.420113
H  -5.744774 -1.108509 3.037235
H  -7.559975 0.110438 1.878668
totalener: -1079.72888699 hartree
nucrepener: 2159.09511629 hartree
electener: -3238.82400328 hartree
oneelecener: -5756.65315948 hartree
twoeener: 2517.82915620 hartree
kineticenergy: 1074.91761977 hartree
xcener: -106.469367978398 hartree
chargesum: -0.0000000
charge: -0.264175 -0.400043 -0.258488 0.143902 -0.062660 -0.113625 -0.280561 -0.243548 -0.161086 0.373020 -0.017345 -0.200481 -0.253252 0.055649 -0.037384 -0.329535 -0.035334 0.256394 -0.129248 0.096173 -0.162228 -0.169250 -0.124895 -0.123494 -0.131657 0.091145 0.081806 0.085491 0.103596 0.086954 0.087802 0.070070 0.090344 0.083310 0.089976 0.058598 0.082485 0.093140 0.096967 0.084092 0.093579 0.112167 0.150850 0.133468 0.101044 0.109551 0.107375 0.108587 0.122534 0.123890 0.124329
qa: -0.2642 -0.4000 -0.2585 0.1439 -0.0627 -0.1136 -0.2806 -0.2435 -0.1611 0.3730 -0.0173 -0.2005 -0.2533 0.0556 -0.0374 -0.3295 -0.0353 0.2564 -0.1292 0.0962 -0.1622 -0.1692 -0.1249 -0.1235 -0.1317 0.0911 0.0818 0.0855 0.1036 0.0870 0.0878 0.0701 0.0903 0.0833 0.0900 0.0586 0.0825 0.0931 0.0970 0.0841 0.0936 0.1122 0.1509 0.1335 0.1010 0.1096 0.1074 0.1086 0.1225 0.1239 0.1243
va: 2.1208 2.0809 2.3098 3.7367 3.8929 3.8513 3.9072 3.9026 3.8755 4.1343 3.7517 3.9393 3.9520 3.9152 3.7068 4.0108 4.0057 3.5322 3.8637 3.6194 4.0186 4.0011 3.9606 3.9665 3.9590 1.0054 1.0319 1.0049 1.0217 0.9977 1.0046 1.0072 1.0051 1.0132 1.0012 1.0039 1.0122 0.9951 1.0019 1.0110 0.9968 1.0063 1.0231 1.0078 1.0122 1.0039 1.0154 1.0109 1.0007 1.0007 0.9999
dispcorr: -0.026296520 hartree
energy: -1079.755183505740
dipole: 16.79905 -16.68505 0.11401 -11.79471 12.01362 0.21891 -4.89916 4.48653 -0.41263
magnitude: 0.48081 au
magnitude: 1.22213 debye
