program: Gaussian 09
title: 000071472
version: EM64L-G09RevD.01
frameworkgroup: C1[X(C11H17NO)]
method: RPBEPBE
basis: SDD
operation: Freq
keyword: #p
keyword: freq=noraman
keyword: PBEPBE/SDD
title: #p freq=noraman PBEPBE/SDD
converged: YES YES NO NO
title: Mulliken charges:
elementType: O N C C C C C C C C C C C H H H H H H H H H H H H H H H H H
charge: -0.283575 -0.357505 -0.172962 -0.407839 0.342357 0.145278 -0.690194 -0.353353 -0.642430 -0.366285 -0.259326 -0.241290 -0.540532 0.229798 0.182523 0.222761 0.252599 0.230793 0.207996 0.214464 0.275569 0.192731 0.242808 0.215083 0.235309 0.222827 0.221269 0.219428 0.220736 0.240964
chargesum: 0.00000
title: Mulliken charges with hydrogens summed into heavy atoms:
elementType: O N C C C C C C C C C C C
charge: -0.283575 -0.104906 0.056836 -0.002555 0.342357 0.145278 -0.036942 -0.077784 0.008191 -0.130976 -0.036500 -0.020021 0.140596
polarizability: 1.45239310e+02 -2.00390506e+00 1.37502784e+02 1.22440724e+00 1.30351882e+01 9.88334111e+01
1716.lowfreq: -7.2232 -0.0006 -0.0003 0.0004 5.4043 11.7836 42.5047 73.5929 91.0031
frequency: 42.3633 73.5787 90.9519 98.7492 127.7475 137.3347 180.9539 184.6041 214.0569 243.6678 255.3573 262.5822 306.8696 350.1746 414.1910 421.6252 466.8686 501.9748 559.3247 561.8722 583.1187 670.1754 720.3535 745.2064 759.0798 773.0510 832.0414 853.8691 904.0295 946.8170 959.4989 983.5935 988.8660 1038.2024 1051.3276 1072.6578 1091.5909 1099.4166 1107.5083 1110.7443 1144.1265 1148.1088 1166.6266 1170.6819 1197.4488 1224.5621 1247.3457 1271.1672 1301.6504 1326.1822 1341.2574 1392.6004 1393.0866 1429.0761 1433.0325 1443.5097 1450.1719 1462.5786 1465.8267 1466.7995 1470.6861 1475.2741 1485.1657 1487.0337 1495.3493 1594.9093 1604.7856 2879.7284 2906.4505 2955.1420 2956.2746 2983.3606 3022.0602 3024.3014 3043.0959 3076.8802 3077.1366 3084.3070 3118.1688 3124.5468 3137.2071 3152.5360 3165.3471 3449.4271
redmass: 3.3888 3.0728 2.4191 3.1454 2.1159 2.6452 2.2850 1.3970 2.0902 1.2180 1.4394 2.6038 3.1634 3.1452 2.8801 3.8725 5.4029 3.1326 2.9540 3.8982 3.1473 1.9185 2.2597 2.8644 1.4550 3.7159 1.5386 1.4309 1.8388 1.3572 2.5950 1.3698 7.0983 2.1178 1.7915 2.0013 1.9770 1.9555 1.3809 1.2626 2.7809 1.7212 1.3498 1.3811 1.9038 2.8375 1.3406 1.4796 1.2327 1.4211 1.6164 1.2286 3.8837 1.3590 1.2110 1.6270 1.2503 1.1527 1.0905 1.0517 1.1765 1.0459 1.7195 1.0704 1.0539 7.0488 6.4160 1.0553 1.0821 1.0594 1.0358 1.0358 1.0754 1.0974 1.1038 1.1003 1.0999 1.1002 1.0992 1.0849 1.0898 1.0940 1.0988 1.0745
irintensity: 0.3944 1.7443 0.6358 6.5474 0.9305 2.6772 1.1905 0.1583 0.4925 0.7596 1.7624 4.9634 0.2300 5.4261 11.9530 0.7088 5.5600 11.2209 22.3930 3.8996 18.0002 60.3467 6.3702 12.3286 88.9309 3.4813 15.6648 0.3099 6.4362 3.6243 7.4344 2.6814 39.8182 10.1483 8.5830 13.8788 9.2933 10.8972 3.4809 0.3127 27.7339 11.6151 1.4202 16.4581 38.9498 86.8995 5.3781 13.6268 2.7067 1.3886 18.4263 10.0808 7.3855 9.7686 17.6494 5.6410 24.5473 41.3522 1.0770 12.6770 42.1687 6.5939 10.4526 13.8167 12.7543 11.0536 23.4706 125.0133 35.0365 95.3399 37.6413 31.3081 34.0253 28.8183 48.9149 22.7711 62.7280 48.0323 24.6328 1.1753 7.5625 26.0955 23.4954 3.0759
temp: 298.150 k
press: 1.00000 atm
elementType: 8 7 6 6 6 6 6 6 6 6 6 6 6 1 1 1 1 1 1 1 1 1 1 1 1 1 1 1 1 1
symmnumber: 1
zpe: 676075.6 jmol-1
zpe.correction: 0.257504 hartree
zpe.thermalcorrener: 0.271640 hartree
zpe.thermalcorrenthalpy: 0.272584 hartree
zpe.thermalcorrgfe: 0.216846 hartree
zpe.sumelectzpe: -558.309215 hartree
zpe.sumelectthermal: -558.295079 hartree
zpe.sumelectthermalent: -558.294135 hartree
zpe.sumelectthermalfe: -558.349873 hartree
dipole: 1.0160 1.3574 0.8953
dipole: 1.9174
quadrupole: -67.5782 -76.5084 -80.1605
quadrupole: 1.6799 1.0337 2.6706
quadrupole: 7.1708 -1.7594 -5.4115 1.6799 1.0337 2.6706
hfenergy: -558.5667189 hartree
pointgroup: C01 [X(C11H17N1O1)]
dipole: 0.3377935 0.6679333 -0.0938585 debye
polarizability: 144.4911343|-3.2551283|136.9384803|-6.9447267|-13.1090222|100.14589 unknown
InChI: InChI=1S/C11H17NO/c1-4-10(12-2)9-7-5-6-8-11(9)13-3/h5-8,10,12H,4H2,1-3H3
charge 0 multiplicity 1
30 atoms
O  0.840493 1.820989 -0.429618
N  -2.286943 -0.217651 1.328647
C  -1.50802 0.329374 0.186021
C  -2.303284 0.034786 -1.119368
C  -0.114852 -0.308176 0.146021
C  1.04798 0.447092 -0.179863
C  -1.663022 0.610958 -2.397865
C  0.041088 -1.686685 0.413995
C  -1.821016 0.200538 2.665248
C  2.323409 -0.168442 -0.239142
C  1.30554 -2.315695 0.355499
C  2.445885 -1.551506 0.026128
C  2.012778 2.641619 -0.733209
H  -1.376993 1.434079 0.265266
H  -3.323416 0.459174 -1.00015
H  -2.419576 -1.062844 -1.210332
H  -3.291812 -0.04209 1.199062
H  -0.665465 0.171524 -2.575428
H  -2.292824 0.39542 -3.280517
H  -1.536327 1.706176 -2.321685
H  -0.858412 -2.24394 0.699479
H  -1.776839 1.307985 2.806942
H  -0.805967 -0.197493 2.842912
H  -2.486745 -0.22309 3.438529
H  3.217095 0.411704 -0.488219
H  1.399923 -3.385966 0.568686
H  3.434057 -2.023207 -0.022226
H  2.51122 2.307028 -1.664005
H  2.742199 2.631117 0.100455
H  1.621945 3.661121 -0.869864
