program: Orca
programVersion: 5.0.2
elementType: O O O C C C C C C C C C C C C C C C C C C C C C C H H H H H H H H H H H H H H H H H H H H H H H H H H
charge: 0
multiplicity: 1
keywords: wb97x-d3
keywords: def2-TZVPP
keywords: def2/J RIJCOSX
keywords: DEFGRID2
keywords: scfconv7
keywords: smallprint printgap noloewdin
keywords: NOSOSCF
formula: C22H26O3
InChI: InChI=1/C22H26O3/c1-15(2)10-19-20(22(19,3)4)21(23)25-14-17-12-18(24-13-17)11-16-8-6-5-7-9-16/h5-10,12-13,19-20H,11,14H2,1-4H3
51 atoms
O  2.073814 1.870917 -1.020551
O  2.660266 1.221396 1.035259
O  -1.675612 1.789861 1.235228
C  4.186033 -1.122731 -0.291592
C  2.759658 -1.542908 -0.386158
C  3.185889 -0.145456 -0.867288
C  4.8410 -0.902834 1.050503
C  5.138565 -1.708006 -1.309756
C  1.889865 -1.720139 0.800684
C  2.645636 1.026019 -0.156915
C  0.556519 -1.661679 0.746073
C  -0.293341 -1.884272 1.95717
C  -0.170547 -1.357366 -0.533706
C  1.334734 2.978254 -0.481833
C  -0.017494 2.553704 -0.024695
C  -1.206316 2.454824 -0.819649
C  -0.371573 2.129806 1.212391
C  -2.181972 1.990274 -0.004119
C  -3.609103 1.634895 -0.225936
C  -3.805824 0.139496 -0.304668
C  -3.941374 -0.62296 0.852474
C  -3.800776 -0.506892 -1.537323
C  -4.062474 -2.004151 0.778929
C  -3.926846 -1.887093 -1.614255
C  -4.052829 -2.640787 -0.455117
H  2.517824 -2.196669 -1.221075
H  3.214931 -0.025951 -1.944319
H  5.662859 -0.189467 0.963446
H  4.169277 -0.535601 1.820244
H  5.264884 -1.844961 1.404577
H  5.986063 -1.041491 -1.482311
H  5.534558 -2.663589 -0.959502
H  4.653381 -1.884402 -2.27102
H  2.368432 -1.931539 1.751887
H  -0.983219 -2.718874 1.804403
H  -0.913358 -1.007364 2.163423
H  0.300554 -2.095416 2.846668
H  0.037068 -2.103218 -1.305408
H  0.123357 -0.390888 -0.948822
H  -1.250189 -1.336961 -0.388975
H  1.254445 3.683412 -1.307666
H  1.895194 3.464068 0.317319
H  -1.312991 2.703569 -1.864399
H  0.171112 2.035959 2.139599
H  -3.933069 2.104617 -1.155434
H  -4.226063 2.054513 0.573469
H  -3.95409 -0.135465 1.820447
H  -3.69726 0.074969 -2.44604
H  -4.164355 -2.583476 1.68801
H  -3.924295 -2.374621 -2.581028
H  -4.146831 -3.717693 -0.512967
elementType: O C H
totalener: -1079.74940969 hartree
nucrepener: 2247.31444605 hartree
electener: -3327.06385574 hartree
oneelecener: -5934.45243733 hartree
twoeener: 2607.38858159 hartree
cpcmener: -0.02411747 hartree
kineticenergy: 1074.85868237 hartree
xcener: -106.463832222469 hartree
chargesum: -0.0000000
charge: -0.288961 -0.464376 -0.275541 0.140983 -0.027821 -0.103406 -0.296956 -0.266492 -0.261861 0.379923 -0.000805 -0.236960 -0.214348 0.080487 -0.052542 -0.345634 -0.029183 0.209015 -0.068848 0.081852 -0.203519 -0.209138 -0.165084 -0.141352 -0.161532 0.109853 0.090056 0.099498 0.092678 0.097565 0.095894 0.093740 0.085663 0.121453 0.101589 0.089382 0.096849 0.115391 0.090160 0.013418 0.117108 0.118624 0.155898 0.166386 0.107337 0.116649 0.140050 0.137523 0.156773 0.155531 0.157029
qa: -0.2890 -0.4644 -0.2755 0.1410 -0.0278 -0.1034 -0.2970 -0.2665 -0.2619 0.3799 -0.0008 -0.2370 -0.2143 0.0805 -0.0525 -0.3456 -0.0292 0.2090 -0.0688 0.0819 -0.2035 -0.2091 -0.1651 -0.1414 -0.1615 0.1099 0.0901 0.0995 0.0927 0.0976 0.0959 0.0937 0.0857 0.1215 0.1016 0.0894 0.0968 0.1154 0.0902 0.0134 0.1171 0.1186 0.1559 0.1664 0.1073 0.1166 0.1400 0.1375 0.1568 0.1555 0.1570
va: 2.1008 2.0221 2.2664 3.7652 3.8107 3.8321 3.8887 3.8970 3.8178 4.1319 3.6624 3.9041 3.9453 3.8342 3.5728 3.9874 3.9178 3.5889 3.8196 3.5335 3.8873 3.9200 3.8604 3.8747 3.8680 1.0053 1.0333 1.0007 1.0192 0.9986 1.0026 1.0025 1.0046 1.0020 0.9953 0.9989 1.0132 1.0057 1.0084 1.0404 0.9938 1.0110 1.0092 1.0092 1.0109 1.0071 1.0105 1.0054 0.9917 0.9911 0.9902
dispcorr: -0.030113904 hartree
energy: -1079.779523594697
dipole: 9.97874 -10.48112 -0.50238 -14.08856 13.98909 -0.09947 -0.97304 -0.19524 -1.16828
magnitude: 1.27560 au
magnitude: 3.24232 debye
