program: Orca
programVersion: 5.0.2
elementType: O O O C C C C C C C C C C C C C C C C C C C C C C H H H H H H H H H H H H H H H H H H H H H H H H H H
charge: 0
multiplicity: 1
keywords: wb97x-d3
keywords: def2-TZVPP
keywords: def2/J RIJCOSX
keywords: DEFGRID2
keywords: scfconv7
keywords: smallprint printgap noloewdin
keywords: NOSOSCF
formula: C22H26O3
InChI: InChI=1/C22H26O3/c1-15(2)10-19-20(22(19,3)4)21(23)25-14-17-12-18(24-13-17)11-16-8-6-5-7-9-16/h5-10,12-13,19-20H,11,14H2,1-4H3
51 atoms
O  2.070154 1.286325 -0.330626
O  1.173419 0.556588 -2.24095
O  -1.588176 1.956176 2.025826
C  4.149985 -0.922941 -0.605937
C  3.029805 -1.474568 0.205388
C  2.736711 -0.823936 -1.152639
C  4.917232 0.296542 -0.15734
C  5.024599 -1.918254 -1.333882
C  2.589547 -0.889289 1.493809
C  1.926982 0.398238 -1.304745
C  1.393213 -1.122598 2.038574
C  1.010386 -0.552491 3.368247
C  0.353683 -1.954173 1.339288
C  1.198639 2.428597 -0.293146
C  -0.066146 2.101374 0.417412
C  -1.17079 1.314361 -0.051471
C  -0.380896 2.4538 1.685076
C  -2.059267 1.253476 0.968114
C  -3.378299 0.583634 1.133175
C  -3.776673 -0.143493 -0.12162
C  -4.557401 0.484611 -1.087111
C  -3.33344 -1.441988 -0.357736
C  -4.891121 -0.170596 -2.264924
C  -3.662375 -2.0991 -1.535161
C  -4.442769 -1.464476 -2.492765
H  2.914561 -2.555172 0.152354
H  2.515444 -1.524262 -1.949746
H  4.344375 0.99007 0.451157
H  5.781111 -0.016069 0.433159
H  5.296462 0.848126 -1.019968
H  4.463254 -2.796779 -1.655353
H  5.476593 -1.469736 -2.221077
H  5.834678 -2.262524 -0.687362
H  3.297385 -0.266696 2.03237
H  1.798249 0.070029 3.793142
H  0.783834 -1.345859 4.086309
H  0.104743 0.054255 3.289071
H  -0.561967 -2.029091 1.926334
H  0.703061 -2.972752 1.152025
H  0.086933 -1.531555 0.367415
H  1.015399 2.805692 -1.299587
H  1.755282 3.188918 0.252798
H  -1.279911 0.858109 -1.021601
H  0.134365 3.039503 2.431014
H  -4.139572 1.323988 1.396399
H  -3.328171 -0.116845 1.972928
H  -4.906802 1.496502 -0.91701
H  -2.722624 -1.943108 0.384682
H  -5.502715 0.330719 -3.004343
H  -3.310467 -3.108989 -1.703995
H  -4.705177 -1.977909 -3.408973
elementType: O C H
totalener: -1079.74670909 hartree
nucrepener: 2229.50339306 hartree
electener: -3309.25010214 hartree
oneelecener: -5898.36138277 hartree
twoeener: 2589.11128063 hartree
cpcmener: -0.02589933 hartree
kineticenergy: 1074.85511244 hartree
xcener: -106.462821992455 hartree
chargesum: -0.0000000
charge: -0.258774 -0.482382 -0.283217 0.134853 -0.040194 -0.133159 -0.291319 -0.267208 -0.218864 0.415619 -0.028603 -0.237704 -0.298550 0.050600 -0.051138 -0.307667 -0.061185 0.186063 -0.004487 0.015821 -0.180870 -0.205101 -0.157751 -0.164098 -0.159900 0.111746 0.090402 0.091473 0.097620 0.102454 0.086107 0.095379 0.093281 0.121273 0.091514 0.109085 0.089284 0.103699 0.113902 0.089908 0.122142 0.109299 0.161396 0.174711 0.105742 0.108989 0.138361 0.151862 0.156777 0.155323 0.157484
qa: -0.2588 -0.4824 -0.2832 0.1349 -0.0402 -0.1332 -0.2913 -0.2672 -0.2189 0.4156 -0.0286 -0.2377 -0.2985 0.0506 -0.0511 -0.3077 -0.0612 0.1861 -0.0045 0.0158 -0.1809 -0.2051 -0.1578 -0.1641 -0.1599 0.1117 0.0904 0.0915 0.0976 0.1025 0.0861 0.0954 0.0933 0.1213 0.0915 0.1091 0.0893 0.1037 0.1139 0.0899 0.1221 0.1093 0.1614 0.1747 0.1057 0.1090 0.1384 0.1519 0.1568 0.1553 0.1575
va: 2.1079 2.0193 2.2527 3.7524 3.7919 3.8695 3.8967 3.9021 3.7810 4.1144 3.6812 3.9086 3.9588 3.8656 3.6299 3.9319 3.9348 3.6599 3.8196 3.6034 3.9356 3.9174 3.9014 3.9260 3.8958 1.0033 1.0310 1.0132 0.9988 1.0006 1.0057 1.0020 1.0024 1.0015 1.0081 0.9953 0.9976 1.0016 1.0023 0.9966 1.0074 1.0009 1.0167 0.9948 1.0081 1.0038 1.0043 0.9970 0.9908 0.9926 0.9900
dispcorr: -0.028644475 hartree
energy: -1079.775353562749
dipole: 14.76580 -14.33735 0.42845 -10.59824 10.43189 -0.16635 5.24511 -4.19039 1.05472
magnitude: 1.15051 au
magnitude: 2.92437 debye
