program: Orca
programVersion: 5.0.2
elementType: O O O C C C C C C C C C C C C C C C C C C C C C C H H H H H H H H H H H H H H H H H H H H H H H H H H
charge: 0
multiplicity: 1
keywords: wb97x-d3
keywords: def2-TZVPP
keywords: def2/J RIJCOSX
keywords: DEFGRID2
keywords: scfconv7
keywords: smallprint printgap noloewdin
keywords: NOSOSCF
formula: C22H26O3
InChI: InChI=1/C22H26O3/c1-15(2)10-19-20(22(19,3)4)21(23)25-14-17-12-18(24-13-17)11-16-8-6-5-7-9-16/h5-10,12-13,19-20H,11,14H2,1-4H3
51 atoms
O  2.285302 1.593582 0.273385
O  2.252911 2.058435 -1.910365
O  -1.886443 2.000283 1.333251
C  3.491548 -1.09477 -0.27102
C  2.085307 -1.300042 -0.742252
C  2.891503 -0.108308 -1.251946
C  3.787873 -0.751264 1.168383
C  4.541294 -2.001618 -0.873593
C  0.887849 -1.126948 0.123026
C  2.45444 1.280936 -1.003759
C  0.49461 -2.00081 1.05319
C  -0.75629 -1.779952 1.846417
C  1.246562 -3.252005 1.385469
C  1.59951 2.814082 0.608727
C  0.132805 2.571375 0.611704
C  -0.743135 2.42439 -0.514084
C  -0.624032 2.299458 1.70023
C  -1.951153 2.069088 -0.017907
C  -3.223894 1.655381 -0.662334
C  -3.376568 0.151105 -0.635379
C  -2.576747 -0.64404 -1.453736
C  -4.274841 -0.466634 0.227456
C  -2.675725 -2.026471 -1.414206
C  -4.377949 -1.852213 0.268556
C  -3.578351 -2.635763 -0.550788
H  1.972253 -2.069875 -1.502629
H  3.239692 -0.214206 -2.273141
H  4.038592 -1.667893 1.706781
H  4.652758 -0.089271 1.243848
H  2.959015 -0.286467 1.693421
H  5.52983 -1.538786 -0.838739
H  4.59723 -2.941812 -0.320383
H  4.325196 -2.243695 -1.915266
H  0.257076 -0.261581 -0.056782
H  -1.274452 -0.865713 1.556604
H  -0.531654 -1.712879 2.914846
H  -1.451115 -2.61554 1.73054
H  0.610592 -4.130286 1.24373
H  1.546325 -3.25926 2.43679
H  2.141108 -3.389482 0.780124
H  1.888077 3.619511 -0.066355
H  1.949528 3.069548 1.607638
H  -0.500649 2.554151 -1.556748
H  -0.406783 2.286097 2.757407
H  -3.213631 2.013256 -1.693274
H  -4.076067 2.129091 -0.169094
H  -1.866991 -0.176731 -2.127165
H  -4.902607 0.13791 0.871689
H  -2.047417 -2.629508 -2.057556
H  -5.083433 -2.318674 0.944653
H  -3.655853 -3.715082 -0.517923
elementType: O C H
totalener: -1079.74633646 hartree
nucrepener: 2275.06436419 hartree
electener: -3354.81070065 hartree
oneelecener: -5989.44453926 hartree
twoeener: 2634.63383861 hartree
cpcmener: -0.02519211 hartree
kineticenergy: 1074.85979729 hartree
xcener: -106.464407679313 hartree
chargesum: -0.0000000
charge: -0.261002 -0.474711 -0.272397 0.107407 -0.018870 -0.113557 -0.282467 -0.273553 -0.221823 0.397011 -0.010307 -0.261422 -0.266667 0.049815 -0.067632 -0.291146 -0.044949 0.191909 -0.046074 0.042298 -0.209185 -0.173271 -0.155749 -0.148947 -0.175069 0.107527 0.093231 0.092417 0.108980 0.094584 0.098112 0.090735 0.087127 0.094062 0.067159 0.113442 0.101186 0.107505 0.100213 0.090123 0.122840 0.111820 0.157592 0.173180 0.116060 0.106753 0.144451 0.136960 0.153370 0.155402 0.155529
qa: -0.2610 -0.4747 -0.2724 0.1074 -0.0189 -0.1136 -0.2825 -0.2736 -0.2218 0.3970 -0.0103 -0.2614 -0.2667 0.0498 -0.0676 -0.2911 -0.0449 0.1919 -0.0461 0.0423 -0.2092 -0.1733 -0.1557 -0.1489 -0.1751 0.1075 0.0932 0.0924 0.1090 0.0946 0.0981 0.0907 0.0871 0.0941 0.0672 0.1134 0.1012 0.1075 0.1002 0.0901 0.1228 0.1118 0.1576 0.1732 0.1161 0.1068 0.1445 0.1370 0.1534 0.1554 0.1555
va: 2.1125 2.0243 2.2685 3.6751 3.7736 3.8743 3.8771 3.9057 3.8305 4.1615 3.6064 3.9398 3.9276 3.8553 3.6268 3.9700 3.9273 3.6558 3.8115 3.5728 3.8754 3.9262 3.8467 3.8757 3.8508 1.0071 1.0267 0.9985 1.0043 1.0121 1.0016 1.0038 1.0052 0.9854 1.0076 1.0014 0.9961 1.0005 0.9960 1.0068 1.0088 1.0008 1.0198 0.9943 1.0079 1.0129 1.0027 1.0049 0.9936 0.9910 0.9917
dispcorr: -0.031129753 hartree
energy: -1079.777466209220
dipole: 10.17466 -10.27414 -0.09948 -19.01993 18.11797 -0.90196 6.22388 -5.21116 1.01272
magnitude: 1.35979 au
magnitude: 3.45632 debye
