program: Orca
programVersion: 5.0.2
elementType: O O O C C C C C C C C C C C C C C C C C C C C C C H H H H H H H H H H H H H H H H H H H H H H H H H H
charge: 0
multiplicity: 1
keywords: wb97x-d3
keywords: def2-TZVPP
keywords: def2/J RIJCOSX
keywords: DEFGRID2
keywords: scfconv7
keywords: smallprint printgap noloewdin
keywords: NOSOSCF
formula: C22H26O3
InChI: InChI=1/C22H26O3/c1-15(2)10-19-20(22(19,3)4)21(23)25-14-17-12-18(24-13-17)11-16-8-6-5-7-9-16/h5-10,12-13,19-20H,11,14H2,1-4H3
51 atoms
O  1.740464 1.884593 0.995302
O  1.702126 0.850456 -0.984882
O  -2.173375 2.497852 -0.994903
C  1.321332 -1.642516 0.917906
C  2.716062 -1.667754 0.395849
C  2.177974 -0.384742 1.016055
C  0.143893 -1.692908 -0.024796
C  1.049752 -2.334359 2.232073
C  3.039689 -1.798296 -1.045618
C  1.861194 0.806342 0.211018
C  4.194532 -1.398527 -1.581859
C  4.489904 -1.578246 -3.03816
C  5.245084 -0.69979 -0.765667
C  1.15769 3.059068 0.414001
C  -0.276282 2.815494 0.106235
C  -1.275575 2.352197 1.021595
C  -0.882982 2.878225 -1.100136
C  -2.404389 2.167619 0.297293
C  -3.730506 1.582804 0.632207
C  -3.718777 0.081616 0.44917
C  -3.648489 -0.763071 1.552819
C  -3.724293 -0.481208 -0.825751
C  -3.584884 -2.141126 1.389671
C  -3.656121 -1.857163 -0.99155
C  -3.585704 -2.692461 0.116383
H  3.43846 -2.147191 1.053686
H  2.533783 -0.156906 2.014463
H  -0.130616 -2.73273 -0.213736
H  -0.723488 -1.201537 0.421584
H  0.326687 -1.225257 -0.988893
H  1.905595 -2.283987 2.906717
H  0.195294 -1.884993 2.742709
H  0.81917 -3.389453 2.068693
H  2.299964 -2.271184 -1.684678
H  3.670169 -2.063664 -3.568314
H  5.391818 -2.178073 -3.187758
H  4.678472 -0.614955 -3.520352
H  6.189784 -0.621786 -1.304266
H  5.446829 -1.20974 0.178249
H  4.934677 0.318349 -0.513857
H  1.708316 3.379913 -0.472401
H  1.279022 3.826826 1.1778
H  -1.15804 2.160994 2.077246
H  -0.534918 3.161957 -2.081304
H  -4.507649 2.037299 0.012751
H  -3.968532 1.825814 1.66847
H  -3.644504 -0.340231 2.550839
H  -3.783426 0.158787 -1.698412
H  -3.534051 -2.783367 2.259898
H  -3.660616 -2.27855 -1.988903
H  -3.533602 -3.765963 -0.013175
elementType: O C H
totalener: -1079.74740754 hartree
nucrepener: 2219.75836266 hartree
electener: -3299.50577020 hartree
oneelecener: -5879.62619792 hartree
twoeener: 2580.12042772 hartree
cpcmener: -0.02682874 hartree
kineticenergy: 1074.86126429 hartree
xcener: -106.461864679857 hartree
chargesum: 0.0000000
charge: -0.292278 -0.453039 -0.274999 0.166360 -0.038064 -0.078811 -0.291254 -0.270968 -0.248998 0.355303 -0.028088 -0.225418 -0.273336 0.095427 -0.051337 -0.367715 -0.036277 0.231194 -0.058159 0.022050 -0.166423 -0.187538 -0.153038 -0.149301 -0.183395 0.115325 0.091902 0.108597 0.051740 0.100169 0.088165 0.092697 0.094572 0.124006 0.085013 0.094570 0.098697 0.097969 0.097014 0.099356 0.114177 0.118028 0.155038 0.172969 0.114092 0.103278 0.137150 0.137593 0.155185 0.155000 0.155802
qa: -0.2923 -0.4530 -0.2750 0.1664 -0.0381 -0.0788 -0.2913 -0.2710 -0.2490 0.3553 -0.0281 -0.2254 -0.2733 0.0954 -0.0513 -0.3677 -0.0363 0.2312 -0.0582 0.0221 -0.1664 -0.1875 -0.1530 -0.1493 -0.1834 0.1153 0.0919 0.1086 0.0517 0.1002 0.0882 0.0927 0.0946 0.1240 0.0850 0.0946 0.0987 0.0980 0.0970 0.0994 0.1142 0.1180 0.1550 0.1730 0.1141 0.1033 0.1371 0.1376 0.1552 0.1550 0.1558
va: 2.1024 2.0309 2.2742 3.7458 3.8534 3.8254 3.9027 3.8999 3.8096 4.1366 3.7060 3.9263 3.9519 3.8583 3.6207 3.9688 3.9640 3.5894 3.8154 3.6369 3.8943 3.9290 3.8592 3.8788 3.8688 1.0013 1.0313 0.9969 1.0149 1.0185 1.0064 1.0031 1.0014 0.9986 1.0086 0.9946 0.9934 1.0052 0.9986 0.9967 1.0068 0.9901 1.0134 0.9964 1.0117 1.0122 1.0040 1.0135 0.9916 0.9919 0.9923
dispcorr: -0.027369336 hartree
energy: -1079.774776872312
dipole: 14.76670 -14.78198 -0.01529 -15.38252 15.33302 -0.04950 -0.16208 1.29667 1.13459
magnitude: 1.13577 au
magnitude: 2.88690 debye
