program: Orca
programVersion: 5.0.2
elementType: O O O C C C C C C C C C C C C C C C C C C C C C C H H H H H H H H H H H H H H H H H H H H H H H H H H
charge: 0
multiplicity: 1
keywords: wb97x-d3
keywords: def2-TZVPP
keywords: def2/J RIJCOSX
keywords: DEFGRID2
keywords: scfconv7
keywords: smallprint printgap noloewdin
keywords: NOSOSCF
formula: C22H26O3
InChI: InChI=1/C22H26O3/c1-15(2)10-19-20(22(19,3)4)21(23)25-14-17-12-18(24-13-17)11-16-8-6-5-7-9-16/h5-10,12-13,19-20H,11,14H2,1-4H3
51 atoms
O  1.670166 1.316935 -1.47319
O  2.728746 1.428563 0.489836
O  -1.467275 2.113432 1.546145
C  4.27275 -1.105193 -0.394361
C  2.984826 -1.611705 0.153999
C  2.980414 -0.501931 -0.908789
C  5.231887 -0.318771 0.465042
C  4.980973 -1.991409 -1.393831
C  2.536374 -1.341664 1.542092
C  2.484291 0.830874 -0.531211
C  1.260614 -1.355072 1.935782
C  0.870277 -1.04333 3.347449
C  0.116323 -1.61786 1.006533
C  0.953386 2.523933 -1.171511
C  -0.191563 2.249743 -0.262498
C  -1.399343 1.551773 -0.592532
C  -0.29132 2.554519 1.052117
C  -2.136625 1.498149 0.542291
C  -3.472864 0.926283 0.870263
C  -3.915287 -0.061152 -0.174926
C  -3.549733 -1.401541 -0.077956
C  -4.663002 0.350994 -1.27363
C  -3.923269 -2.310721 -1.057254
C  -5.037498 -0.556107 -2.256649
C  -4.667462 -1.889695 -2.15195
H  2.650706 -2.561073 -0.256537
H  2.680853 -0.819218 -1.900887
H  5.925767 -1.00646 0.953444
H  5.826722 0.360757 -0.14835
H  4.756116 0.272053 1.241776
H  5.618507 -1.403252 -2.057072
H  5.616265 -2.717068 -0.881513
H  4.27913 -2.548399 -2.016307
H  3.30162 -1.118387 2.279371
H  0.326187 -1.874747 3.803581
H  0.197447 -0.181089 3.37722
H  1.73242 -0.817977 3.975256
H  -0.589534 -2.327118 1.448584
H  0.422486 -2.011083 0.037284
H  -0.445058 -0.695974 0.822645
H  0.60259 2.881384 -2.138704
H  1.61975 3.281949 -0.757764
H  -1.668229 1.143233 -1.554458
H  0.363991 3.063567 1.742098
H  -4.209439 1.731279 0.961828
H  -3.426376 0.440575 1.849092
H  -2.970873 -1.73853 0.774287
H  -4.957124 1.390633 -1.361361
H  -3.634344 -3.350144 -0.964586
H  -5.620977 -0.219648 -3.104413
H  -4.960256 -2.598254 -2.916313
elementType: O C H
totalener: -1079.74992477 hartree
nucrepener: 2205.60401064 hartree
electener: -3285.35393540 hartree
oneelecener: -5850.71384078 hartree
twoeener: 2565.35990538 hartree
cpcmener: -0.02479798 hartree
kineticenergy: 1074.85551660 hartree
xcener: -106.463253086407 hartree
chargesum: -0.0000000
charge: -0.291784 -0.464878 -0.283416 0.138666 -0.026313 -0.098044 -0.298763 -0.265068 -0.251692 0.380407 -0.015695 -0.224263 -0.249014 0.090613 -0.081383 -0.304207 -0.019712 0.172593 -0.005925 0.025193 -0.217777 -0.191116 -0.159465 -0.152397 -0.164896 0.107659 0.089001 0.097310 0.099335 0.094258 0.094762 0.094300 0.085687 0.120419 0.095885 0.087759 0.089506 0.107145 0.099763 0.053596 0.119074 0.115020 0.155841 0.169864 0.106178 0.108315 0.158803 0.139186 0.155228 0.156902 0.157541
qa: -0.2918 -0.4649 -0.2834 0.1387 -0.0263 -0.0980 -0.2988 -0.2651 -0.2517 0.3804 -0.0157 -0.2243 -0.2490 0.0906 -0.0814 -0.3042 -0.0197 0.1726 -0.0059 0.0252 -0.2178 -0.1911 -0.1595 -0.1524 -0.1649 0.1077 0.0890 0.0973 0.0993 0.0943 0.0948 0.0943 0.0857 0.1204 0.0959 0.0878 0.0895 0.1071 0.0998 0.0536 0.1191 0.1150 0.1558 0.1699 0.1062 0.1083 0.1588 0.1392 0.1552 0.1569 0.1575
va: 2.1083 2.0245 2.2607 3.7452 3.8175 3.8410 3.8906 3.8994 3.8377 4.1346 3.7172 3.9256 3.9420 3.8422 3.6493 3.9298 3.9241 3.6348 3.8100 3.6234 3.9421 3.9287 3.9175 3.8938 3.9015 1.0063 1.0317 0.9986 1.0005 1.0182 1.0027 1.0023 1.0043 1.0008 0.9978 1.0003 1.0076 1.0025 1.0088 1.0076 0.9915 1.0110 1.0069 1.0020 1.0031 1.0086 0.9905 1.0045 0.9927 0.9904 0.9899
dispcorr: -0.027514982 hartree
energy: -1079.777439747223
dipole: 12.25460 -12.87418 -0.61957 -13.15076 12.59069 -0.56007 3.28931 -4.07966 -0.79036
magnitude: 1.14987 au
magnitude: 2.92275 debye
