program: Orca
programVersion: 5.0.2
elementType: O O O C C C C C C C C C C C C C C C C C C C C C C H H H H H H H H H H H H H H H H H H H H H H H H H H
charge: 0
multiplicity: 1
keywords: wb97x-d3
keywords: def2-TZVPP
keywords: def2/J RIJCOSX
keywords: DEFGRID2
keywords: scfconv7
keywords: smallprint printgap noloewdin
keywords: NOSOSCF
formula: C22H26O3
InChI: InChI=1/C22H26O3/c1-15(2)10-19-20(22(19,3)4)21(23)25-14-17-12-18(24-13-17)11-16-8-6-5-7-9-16/h5-10,12-13,19-20H,11,14H2,1-4H3
51 atoms
O  2.171772 1.899758 -0.776004
O  2.220857 0.873327 1.207779
O  -2.138703 2.712013 -0.875411
C  4.211169 -1.103094 -0.156546
C  2.851632 -1.656462 -0.403756
C  3.145827 -0.190307 -0.735067
C  4.72398 -0.913208 1.249242
C  5.300757 -1.489183 -1.130092
C  1.938747 -2.047096 0.699186
C  2.481424 0.879609 0.027648
C  0.605869 -2.056684 0.622848
C  -0.235072 -2.481287 1.787207
C  -0.154361 -1.613256 -0.588508
C  1.442078 3.007129 -0.225062
C  -0.022291 2.744015 -0.21215
C  -0.808118 2.043308 0.761362
C  -0.892759 3.121504 -1.178049
C  -2.084396 2.053833 0.307485
C  -3.349155 1.466364 0.825612
C  -3.626259 0.085056 0.275434
C  -3.683583 -1.012036 1.12886
C  -3.813677 -0.121205 -1.090721
C  -3.918513 -2.289043 0.633463
C  -4.042414 -1.395561 -1.588609
C  -4.095269 -2.485249 -0.728055
H  2.755114 -2.258603 -1.303762
H  3.252967 0.03068 -1.790685
H  5.220744 -1.826555 1.583364
H  5.463982 -0.110967 1.279211
H  3.951761 -0.675688 1.975111
H  4.917943 -1.61506 -2.143887
H  6.085478 -0.730494 -1.162991
H  5.764221 -2.43223 -0.83268
H  2.40278 -2.365864 1.628047
H  -0.886555 -1.665573 2.112107
H  0.369581 -2.787353 2.641152
H  -0.891429 -3.313907 1.520943
H  0.484893 -1.393349 -1.442096
H  -0.732492 -0.710958 -0.368664
H  -0.875223 -2.374127 -0.897861
H  1.667878 3.842499 -0.886368
H  1.814929 3.258244 0.768384
H  -0.465667 1.592672 1.679325
H  -0.767869 3.677525 -2.094762
H  -4.183852 2.134931 0.596192
H  -3.281851 1.415692 1.913031
H  -3.542557 -0.868329 2.19384
H  -3.783876 0.717417 -1.776023
H  -3.960938 -3.129659 1.314593
H  -4.18332 -1.538197 -2.65265
H  -4.275691 -3.479006 -1.11768
elementType: O C H
totalener: -1079.74997617 hartree
nucrepener: 2226.92732014 hartree
electener: -3306.67729631 hartree
oneelecener: -5893.68324459 hartree
twoeener: 2587.00594828 hartree
cpcmener: -0.02448519 hartree
kineticenergy: 1074.86393050 hartree
xcener: -106.464551873196 hartree
chargesum: -0.0000000
charge: -0.289106 -0.471103 -0.277910 0.134208 -0.022475 -0.109954 -0.302252 -0.263908 -0.244786 0.406586 0.018513 -0.268952 -0.279245 0.067337 -0.049681 -0.373508 -0.040226 0.266778 -0.053903 0.017269 -0.198505 -0.180134 -0.142135 -0.147790 -0.177443 0.110336 0.091602 0.098659 0.098985 0.095841 0.086186 0.094643 0.094168 0.119456 0.094674 0.099992 0.098971 0.104845 0.063255 0.108698 0.117014 0.116316 0.157287 0.173761 0.114486 0.100287 0.140795 0.135195 0.155915 0.154974 0.155984
qa: -0.2891 -0.4711 -0.2779 0.1342 -0.0225 -0.1100 -0.3023 -0.2639 -0.2448 0.4066 0.0185 -0.2690 -0.2792 0.0673 -0.0497 -0.3735 -0.0402 0.2668 -0.0539 0.0173 -0.1985 -0.1801 -0.1421 -0.1478 -0.1774 0.1103 0.0916 0.0987 0.0990 0.0958 0.0862 0.0946 0.0942 0.1195 0.0947 0.1000 0.0990 0.1048 0.0633 0.1087 0.1170 0.1163 0.1573 0.1738 0.1145 0.1003 0.1408 0.1352 0.1559 0.1550 0.1560
va: 2.1127 2.0173 2.2768 3.7379 3.8291 3.8431 3.8960 3.8991 3.8412 4.0907 3.6175 3.9445 3.9580 3.8661 3.6233 3.9551 3.9726 3.5544 3.8016 3.6233 3.8719 3.9106 3.8377 3.8868 3.8742 1.0060 1.0311 0.9982 1.0008 1.0168 1.0046 1.0026 1.0019 1.0010 0.9941 1.0125 0.9964 1.0148 1.0070 1.0004 0.9968 1.0092 1.0205 0.9946 1.0071 1.0122 1.0033 1.0182 0.9922 0.9918 0.9914
dispcorr: -0.029014959 hartree
energy: -1079.778991127972
dipole: 11.58222 -11.63980 -0.05758 -15.89724 15.88181 -0.01543 2.62861 -3.31053 -0.68191
magnitude: 0.68452 au
magnitude: 1.73990 debye
