program: Gaussian 09
title: 000071532
version: EM64L-G09RevD.01
frameworkgroup: C1[X(C23H26NO3)]
method: RPBEPBE
basis: SDD
operation: Freq
keyword: #p
keyword: freq=noraman
keyword: PBEPBE/SDD
title: #p freq=noraman PBEPBE/SDD
converged: YES YES NO NO
title: Mulliken charges:
elementType: O O O N C C C C C C C C C C C C C C C C C C C C C C C H H H H H H H H H H H H H H H H H H H H H H H H H H
charge: -0.284852 -0.199366 -0.266936 -0.100929 -0.086079 -0.071895 -0.508683 -0.510524 -0.549326 -0.567385 0.005828 -0.585426 -0.567679 0.286621 -0.514147 0.380179 0.328530 0.134466 0.142243 -0.394830 -0.395573 -0.354618 -0.353328 -0.249002 -0.258839 -0.211266 -0.214923 0.292842 0.293799 0.283039 0.272873 0.264313 0.282975 0.264165 0.309348 0.275702 0.263995 0.272754 0.266343 0.286982 0.264002 0.285998 0.266159 0.263803 0.285449 0.234115 0.241173 0.266860 0.270200 0.238662 0.234124 0.243942 0.244122
chargesum: 1.00000
title: Mulliken charges with hydrogens summed into heavy atoms:
elementType: O O O N C C C C C C C C C C C C C C C C C C C C C C C
charge: -0.284852 -0.199366 -0.266936 -0.100929 0.206763 0.221905 0.047229 0.036765 0.024188 -0.027688 0.278582 0.231902 0.248281 0.286621 -0.228698 0.380179 0.328530 0.134466 0.142243 -0.160715 -0.154400 -0.087758 -0.083129 -0.010340 -0.024716 0.032676 0.029199
polarizability: 2.81032872e+02 -3.29337515e+01 2.80076358e+02 3.32160455e+01 1.11964822e+01 1.91394636e+02
1716.lowfreq: -10.8313 -0.0006 -0.0002 0.0006 2.1599 9.3419 17.9659 19.0477 37.4054
frequency: 16.4465 17.7662 36.9100 51.1708 59.3215 84.2956 93.3449 108.3180 124.7122 151.6579 172.8169 191.4486 210.0662 214.1960 253.9153 268.9880 272.0501 302.7708 309.7642 332.8365 367.3908 378.7923 381.3883 391.4154 397.6978 415.6545 447.2801 455.5324 464.0288 485.5329 507.1449 518.0788 527.0435 535.6107 544.2732 592.3445 606.4945 633.0456 653.7005 665.5253 667.3016 692.4124 720.7218 731.8566 748.1525 759.6319 765.5209 766.9313 806.2553 815.6574 826.2586 853.1135 861.8182 864.0808 867.8097 881.8931 886.5870 890.4286 894.1996 910.4088 917.1569 947.1336 950.2466 980.6585 981.5943 985.3086 988.7063 1002.7090 1016.7396 1030.0407 1031.2771 1031.7876 1040.9569 1056.5061 1086.9554 1089.9822 1093.5565 1107.8259 1128.3450 1158.2041 1164.6812 1167.4268 1167.7450 1169.7130 1172.5559 1183.8005 1191.8142 1202.4310 1202.9708 1215.2569 1229.2240 1231.8997 1240.2474 1258.2849 1260.2716 1282.1856 1285.1413 1297.0822 1301.1522 1316.3188 1319.8855 1324.7313 1328.7621 1337.6085 1357.1316 1374.3115 1388.5542 1393.4442 1416.8435 1441.5936 1447.2616 1449.1965 1457.1229 1458.3825 1470.8043 1476.8268 1478.3596 1483.0595 1495.3958 1500.1082 1512.3614 1517.9303 1582.6024 1603.3012 1608.0162 1629.4016 1654.1312 3022.3631 3026.3155 3028.1970 3030.9248 3031.0712 3034.2808 3036.8650 3044.6219 3060.2996 3067.8894 3079.7459 3083.3628 3091.5959 3110.1510 3121.2094 3123.8206 3131.3348 3137.3044 3145.1163 3148.1379 3161.7195 3165.2415 3171.7441 3177.5570 3179.1866 3181.0482
redmass: 3.8634 5.2361 4.6654 4.1946 5.0751 7.2082 4.1337 1.2016 4.0985 5.3457 5.1585 1.8080 2.6769 1.7535 5.0713 3.2670 2.8620 3.6857 4.8066 4.8791 6.4991 2.8894 2.2629 4.2031 3.7509 2.1354 3.0350 3.2664 3.4873 2.3949 3.7695 4.8346 4.2326 4.1895 3.9378 6.5370 6.5550 3.9155 5.4725 4.5428 4.9751 5.0276 5.1681 4.3430 3.2573 3.2595 1.3087 1.5089 1.6865 2.7263 4.2873 2.1434 4.4543 2.0464 1.4605 2.8941 1.5063 4.0616 4.0054 3.3793 3.0050 1.3848 1.4146 2.6743 3.1605 1.3163 1.3242 2.2441 1.8614 2.2108 1.6104 2.0337 2.4392 2.6394 1.3017 2.2770 1.9792 2.3060 1.2188 1.9166 1.3551 1.9439 1.6885 1.1160 1.0769 1.7396 1.4932 1.5063 1.4431 2.3183 1.5060 1.2325 3.0156 1.5201 1.4701 1.8255 1.4265 1.4215 1.4247 1.7278 1.3723 1.3516 1.3978 1.4622 1.4375 1.4509 7.5432 9.9544 1.1336 2.4335 1.1556 2.4935 1.0568 1.0529 2.5656 1.0592 1.0544 2.7263 1.0651 1.0752 1.0782 1.0623 6.5817 7.2950 7.1039 7.5634 10.3347 1.0751 1.0670 1.0640 1.0374 1.0844 1.0364 1.0628 1.0657 1.0863 1.0890 1.1017 1.1015 1.1039 1.1041 1.0894 1.0880 1.1048 1.1044 1.0894 1.0885 1.0945 1.0942 1.1019 1.0992 1.0998 1.1009
irintensity: 0.7582 2.4969 0.1139 0.5020 1.7907 0.5873 1.4841 0.3100 0.2471 3.1545 8.4649 0.5022 0.3523 0.1750 1.2153 1.0280 0.1723 4.9916 0.6833 5.1154 1.2921 0.8245 0.5397 0.3580 0.5088 0.1402 3.9840 2.8178 3.2353 1.1733 0.9097 0.9859 4.4880 0.7427 3.4561 6.5229 4.6343 2.3036 8.4609 2.8286 8.1879 13.3470 0.3374 3.9730 7.7979 41.3991 72.2396 72.9621 5.9298 0.5027 21.7064 18.3765 2.1290 1.7466 0.7782 32.8544 2.3677 2.0238 23.1139 49.2166 16.5687 1.6984 2.2717 62.3928 43.4730 1.8362 0.7870 1.7734 7.4783 4.6463 22.9800 4.4423 217.7276 206.7645 2.8057 19.7355 1.8439 27.0188 5.4226 4.2819 0.7004 8.6802 2.2322 3.2574 2.3225 67.9983 0.4195 19.3258 0.4704 37.6566 0.6075 3.3977 211.2897 66.9116 10.0157 4.6066 0.2561 6.3234 15.3088 8.9720 4.2365 0.3269 2.9348 2.3387 1.1808 8.8567 2.4446 1.4617 7.9742 73.7275 29.4502 17.8736 7.6248 1.6139 143.0521 52.9552 37.7347 10.6139 3.7855 54.4806 13.8018 1.8851 33.8730 11.3465 14.7684 12.4088 107.6635 4.8814 6.7224 5.8762 3.5851 5.6676 8.3369 5.4262 11.5724 14.5238 13.8429 0.6059 15.6143 0.6324 19.7485 6.5790 6.2616 0.3131 5.0648 8.2395 6.4074 16.6725 12.4317 3.9595 8.6323 8.5569 2.3078
temp: 298.150 k
press: 1.00000 atm
elementType: 8 8 8 7 6 6 6 6 6 6 6 6 6 6 6 6 6 6 6 6 6 6 6 6 6 6 6 1 1 1 1 1 1 1 1 1 1 1 1 1 1 1 1 1 1 1 1 1 1 1 1 1 1
symmnumber: 1
zpe: 1164659.9 jmol-1
zpe.correction: 0.443596 hartree
zpe.thermalcorrener: 0.466567 hartree
zpe.thermalcorrenthalpy: 0.467511 hartree
zpe.thermalcorrgfe: 0.390102 hartree
zpe.sumelectzpe: -1170.272677 hartree
zpe.sumelectthermal: -1170.249706 hartree
zpe.sumelectthermalent: -1170.248761 hartree
zpe.sumelectthermalfe: -1170.326171 hartree
dipole: -19.1728 0.4920 -1.2950
dipole: 19.2228
quadrupole: -41.7388 -131.0002 -148.7162
quadrupole: -6.6945 0.9932 4.3113
quadrupole: 65.4129 -23.8485 -41.5644 -6.6945 0.9932 4.3113
hfenergy: -1170.7162722 hartree
pointgroup: C01 [X(C23H26N1O3)]
dipole: -7.4922898 -0.9610759 0.371957 debye
polarizability: 275.6961946|31.4063025|287.1696158|-33.1260133|6.1642737|189.638055 unknown
InChI: InChI=1S/C23H26NO3/c1-24(2)15-11-12-16(24)14-17(13-15)26-23(25)22-18-7-3-5-9-20(18)27-21-10-6-4-8-19(21)22/h3-10,15-17,22H,11-14H2,1-2H3
charge 1 multiplicity 1
53 atoms
O  -0.880005 0.531119 0.892366
O  0.232987 1.287198 -1.012813
O  3.567652 -0.358454 -1.021333
N  -4.76309 -0.751124 -0.025246
C  -3.86152 -0.497088 -1.285871
C  -4.661054 0.659196 0.657879
C  -4.406902 0.861946 -1.808249
C  -4.924816 1.619936 -0.536043
C  -2.386413 -0.402847 -0.849844
C  -3.248825 0.840976 1.253614
C  -2.156036 0.748818 0.165669
C  -4.314369 -1.914148 0.845877
C  -6.203023 -1.044132 -0.441263
C  0.293258 0.829821 0.143838
C  1.548627 0.447288 0.946073
C  2.716338 1.345144 0.564427
C  1.845409 -1.023068 0.628768
C  3.632099 0.928355 -0.428354
C  2.797777 -1.342483 -0.370797
C  2.885682 2.62898 1.133094
C  1.159179 -2.083341 1.267787
C  4.674642 1.764099 -0.875862
C  3.040358 -2.679163 -0.755315
C  3.92684 3.479707 0.706052
C  1.398784 -3.425707 0.904822
C  4.815354 3.046668 -0.308525
C  2.333867 -3.719083 -0.119713
H  -4.019217 -1.336181 -1.984826
H  -5.433985 0.706185 1.443683
H  -5.209938 0.719916 -2.549566
H  -3.600805 1.413333 -2.317424
H  -4.386053 2.567266 -0.375888
H  -5.993153 1.876011 -0.62328
H  -2.020923 -1.35686 -0.430057
H  -1.779455 -0.214163 -1.75241
H  -3.213811 1.835535 1.732471
H  -3.047656 0.112908 2.058214
H  -2.067076 1.702339 -0.387273
H  -4.39335 -2.842121 0.258003
H  -3.280244 -1.785379 1.180482
H  -4.978829 -1.974145 1.722209
H  -6.598783 -0.23259 -1.062787
H  -6.221765 -1.986454 -1.010555
H  -6.819785 -1.147142 0.465123
H  1.298091 0.554923 2.016173
H  2.191415 2.964566 1.913565
H  0.440414 -1.845623 2.061207
H  5.359174 1.39649 -1.645509
H  3.788546 -2.879141 -1.527674
H  4.046325 4.470363 1.155574
H  0.877266 -4.238291 1.421065
H  5.623228 3.702613 -0.648511
H  2.526969 -4.757672 -0.407647
