program: Orca
programVersion: 5.0.2
elementType: O O O C C C C C C C C C C C C C C C C C C C C C C H H H H H H H H H H H H H H H H H H H H H H H H H H
charge: 0
multiplicity: 1
keywords: wb97x-d3
keywords: def2-TZVPP
keywords: def2/J RIJCOSX
keywords: DEFGRID2
keywords: scfconv7
keywords: smallprint printgap noloewdin
keywords: NOSOSCF
formula: C22H26O3
InChI: InChI=1/C22H26O3/c1-15(2)10-19-20(22(19,3)4)21(23)25-14-17-12-18(24-13-17)11-16-8-6-5-7-9-16/h5-10,12-13,19-20H,11,14H2,1-4H3
51 atoms
O  2.314667 1.362908 0.252836
O  2.112704 1.611239 -1.955631
O  -1.888161 2.008335 1.444004
C  4.14375 -1.009895 -0.249968
C  2.76135 -1.563828 -0.260051
C  3.108305 -0.362511 -1.151144
C  4.694024 -0.317912 0.973018
C  5.20515 -1.791848 -0.990907
C  1.846744 -1.473508 0.902695
C  2.472809 0.958825 -0.999205
C  0.519486 -1.586536 0.810209
C  -0.357099 -1.553713 2.022878
C  -0.172333 -1.735681 -0.515914
C  1.595292 2.580404 0.505798
C  0.130418 2.335288 0.582437
C  -0.806189 2.123978 -0.483087
C  -0.59185 2.246506 1.72413
C  -2.013635 1.928132 0.097576
C  -3.362654 1.620077 -0.449247
C  -3.659229 0.137874 -0.454884
C  -3.929502 -0.54259 0.730627
C  -3.641278 -0.579098 -1.647152
C  -4.167565 -1.909875 0.723379
C  -3.888141 -1.946023 -1.658646
C  -4.147342 -2.616995 -0.472254
H  2.628017 -2.464787 -0.855198
H  3.217242 -0.606014 -2.201797
H  5.436465 0.430424 0.689132
H  3.946263 0.17494 1.5869
H  5.198593 -1.052024 1.604896
H  5.641107 -2.555336 -0.343075
H  4.802902 -2.296475 -1.870389
H  6.014229 -1.138489 -1.32431
H  2.29382 -1.350469 1.884522
H  -0.946468 -2.4714 2.105468
H  -1.077439 -0.733489 1.967511
H  0.215877 -1.437982 2.943235
H  -1.25143 -1.830483 -0.398809
H  0.173202 -2.619713 -1.057945
H  0.01223 -0.87774 -1.1672
H  1.842825 3.334703 -0.241489
H  1.968128 2.929359 1.467794
H  -0.605895 2.121729 -1.54249
H  -0.326651 2.346258 2.765627
H  -3.413662 2.006371 -1.467804
H  -4.123135 2.153105 0.127833
H  -3.958404 -0.002038 1.669537
H  -3.434879 -0.064082 -2.578237
H  -4.374157 -2.423398 1.65408
H  -3.874837 -2.486742 -2.596633
H  -4.335823 -3.68301 -0.47825
elementType: O C H
totalener: -1079.74708896 hartree
nucrepener: 2255.39163712 hartree
electener: -3335.13872608 hartree
oneelecener: -5950.24635777 hartree
twoeener: 2615.10763169 hartree
cpcmener: -0.02499978 hartree
kineticenergy: 1074.85294681 hartree
xcener: -106.462935947003 hartree
chargesum: 0.0000000
charge: -0.258196 -0.484860 -0.276362 0.143392 -0.038747 -0.138914 -0.290781 -0.267762 -0.228437 0.416892 -0.021473 -0.246054 -0.238013 0.050335 -0.018787 -0.358914 -0.061058 0.239886 -0.056650 0.066708 -0.230958 -0.200462 -0.153912 -0.145173 -0.152708 0.111312 0.090038 0.101288 0.090080 0.097431 0.093360 0.086404 0.095750 0.122067 0.108640 0.082206 0.099737 0.038599 0.113874 0.095377 0.121692 0.108744 0.158562 0.172245 0.102656 0.116353 0.140170 0.137582 0.156300 0.154249 0.156288
qa: -0.2582 -0.4849 -0.2764 0.1434 -0.0387 -0.1389 -0.2908 -0.2678 -0.2284 0.4169 -0.0215 -0.2461 -0.2380 0.0503 -0.0188 -0.3589 -0.0611 0.2399 -0.0567 0.0667 -0.2310 -0.2005 -0.1539 -0.1452 -0.1527 0.1113 0.0900 0.1013 0.0901 0.0974 0.0934 0.0864 0.0958 0.1221 0.1086 0.0822 0.0997 0.0386 0.1139 0.0954 0.1217 0.1087 0.1586 0.1722 0.1027 0.1164 0.1402 0.1376 0.1563 0.1542 0.1563
va: 2.1098 2.0150 2.2656 3.7442 3.7967 3.8683 3.8975 3.9009 3.7904 4.1144 3.6760 3.9056 3.9529 3.8595 3.5690 3.9673 3.9331 3.5892 3.8036 3.5642 3.9004 3.9147 3.8627 3.8678 3.8610 1.0043 1.0316 1.0010 1.0132 0.9987 1.0023 1.0057 1.0021 1.0011 0.9963 0.9938 1.0124 1.0277 1.0059 1.0033 1.0075 1.0014 1.0220 0.9957 1.0123 1.0086 1.0148 1.0051 0.9918 0.9921 0.9903
dispcorr: -0.030555396 hartree
energy: -1079.777644357808
dipole: 10.89582 -10.92051 -0.02469 -13.92669 13.41271 -0.51398 2.54790 -1.67998 0.86791
magnitude: 1.00899 au
magnitude: 2.56465 debye
