program: Orca
programVersion: 5.0.2
elementType: O O O C C C C C C C C C C C C C C C C C C C C C C H H H H H H H H H H H H H H H H H H H H H H H H H H
charge: 0
multiplicity: 1
keywords: wb97x-d3
keywords: def2-TZVPP
keywords: def2/J RIJCOSX
keywords: DEFGRID2
keywords: scfconv7
keywords: smallprint printgap noloewdin
keywords: NOSOSCF
formula: C22H26O3
InChI: InChI=1/C22H26O3/c1-15(2)10-19-20(22(19,3)4)21(23)25-14-17-12-18(24-13-17)11-16-8-6-5-7-9-16/h5-10,12-13,19-20H,11,14H2,1-4H3
51 atoms
O  2.137343 2.018122 0.327007
O  2.108749 0.141518 1.542305
O  -2.048178 1.946509 -1.120721
C  4.82468 -0.546359 0.204355
C  3.797881 -0.951299 -0.794545
C  3.755323 0.455636 -0.175193
C  4.868722 -1.179077 1.57353
C  6.1996 -0.211484 -0.327649
C  2.743676 -1.954007 -0.515504
C  2.607523 0.815936 0.672506
C  1.614712 -2.042913 -1.223748
C  0.588777 -3.094804 -0.941318
C  1.300986 -1.080251 -2.336165
C  0.92336 2.480313 0.936609
C  -0.272994 1.973165 0.211543
C  -0.813257 0.645255 0.176602
C  -1.067828 2.710118 -0.600229
C  -1.883514 0.686849 -0.6516
C  -2.88369 -0.33642 -1.060341
C  -4.060368 -0.378795 -0.114623
C  -5.134994 0.492385 -0.268587
C  -4.066232 -1.27012 0.954279
C  -6.193468 0.472868 0.629598
C  -5.123376 -1.292601 1.852921
C  -6.191057 -0.419888 1.692984
H  4.117416 -0.918326 -1.833531
H  4.077835 1.253884 -0.833295
H  5.291363 -0.485116 2.302648
H  3.900442 -1.498036 1.947279
H  5.516767 -2.0575 1.546501
H  6.816115 -1.110397 -0.393775
H  6.155994 0.231919 -1.323564
H  6.712223 0.495259 0.328233
H  2.917638 -2.663063 0.287648
H  0.401626 -3.708913 -1.826567
H  -0.371143 -2.643037 -0.673219
H  0.887609 -3.757343 -0.128664
H  0.331717 -1.2895 -2.789044
H  2.048175 -1.123565 -3.132786
H  1.279745 -0.045998 -1.984634
H  0.968498 3.566208 0.866235
H  0.899122 2.216632 1.994482
H  -0.455844 -0.224737 0.703792
H  -1.049076 3.749698 -0.889983
H  -2.391463 -1.310146 -1.079333
H  -3.223136 -0.133599 -2.078902
H  -5.147504 1.190793 -1.097517
H  -3.234705 -1.953704 1.083404
H  -7.023541 1.155343 0.497092
H  -5.113979 -1.994825 2.677038
H  -7.01755 -0.436888 2.391965
elementType: O C H
totalener: -1079.74822683 hartree
nucrepener: 2164.28247454 hartree
electener: -3244.03070137 hartree
oneelecener: -5767.97716916 hartree
twoeener: 2523.94646779 hartree
cpcmener: -0.02537909 hartree
kineticenergy: 1074.85970850 hartree
xcener: -106.460984098216 hartree
chargesum: 0.0000000
charge: -0.288771 -0.468581 -0.279195 0.131326 -0.036658 -0.097797 -0.294802 -0.264018 -0.239405 0.396558 -0.028282 -0.209133 -0.298397 0.072735 -0.067949 -0.363261 -0.041874 0.261536 -0.066122 0.053193 -0.207057 -0.198272 -0.152146 -0.152707 -0.173883 0.111697 0.090477 0.099767 0.092816 0.097743 0.093879 0.085320 0.095654 0.121604 0.102605 0.077001 0.090671 0.102290 0.114543 0.095707 0.113491 0.116216 0.159882 0.174315 0.110693 0.115943 0.139044 0.142258 0.155855 0.156410 0.157080
qa: -0.2888 -0.4686 -0.2792 0.1313 -0.0367 -0.0978 -0.2948 -0.2640 -0.2394 0.3966 -0.0283 -0.2091 -0.2984 0.0727 -0.0679 -0.3633 -0.0419 0.2615 -0.0661 0.0532 -0.2071 -0.1983 -0.1521 -0.1527 -0.1739 0.1117 0.0905 0.0998 0.0928 0.0977 0.0939 0.0853 0.0957 0.1216 0.1026 0.0770 0.0907 0.1023 0.1145 0.0957 0.1135 0.1162 0.1599 0.1743 0.1107 0.1159 0.1390 0.1423 0.1559 0.1564 0.1571
va: 2.1022 2.0178 2.2804 3.7730 3.8142 3.8388 3.8912 3.8978 3.7940 4.0971 3.6716 3.9139 3.9561 3.8708 3.6632 3.9791 3.9767 3.5693 3.7983 3.5982 3.9741 3.9364 3.8994 3.9032 3.9020 1.0038 1.0332 1.0004 1.0188 0.9989 1.0025 1.0048 1.0026 1.0018 0.9951 0.9962 1.0099 1.0045 1.0020 0.9942 0.9974 1.0086 1.0186 0.9948 1.0081 1.0149 1.0097 1.0029 0.9911 0.9913 0.9906
dispcorr: -0.026555001 hartree
energy: -1079.774781833230
dipole: 16.33263 -16.07928 0.25335 -12.87005 13.10037 0.23032 -3.73865 2.88088 -0.85778
magnitude: 0.92359 au
magnitude: 2.34757 debye
