program: Orca
programVersion: 5.0.2
elementType: O O O C C C C C C C C C C C C C C C C C C C C C C H H H H H H H H H H H H H H H H H H H H H H H H H H
charge: 0
multiplicity: 1
keywords: wb97x-d3
keywords: def2-TZVPP
keywords: def2/J RIJCOSX
keywords: DEFGRID2
keywords: scfconv7
keywords: smallprint printgap noloewdin
keywords: NOSOSCF
formula: C22H26O3
InChI: InChI=1/C22H26O3/c1-15(2)10-19-20(22(19,3)4)21(23)25-14-17-12-18(24-13-17)11-16-8-6-5-7-9-16/h5-10,12-13,19-20H,11,14H2,1-4H3
51 atoms
O  2.094388 1.464271 0.180311
O  4.077186 2.379193 -0.258892
O  -1.990666 2.087452 -0.871408
C  3.515348 -1.163739 0.590659
C  3.068067 -1.129944 -0.835397
C  3.896927 0.023148 -0.281289
C  2.540978 -1.020786 1.735315
C  4.667535 -2.083933 0.924166
C  1.662303 -0.94105 -1.282177
C  3.382756 1.3968 -0.115263
C  0.650279 -1.78127 -1.056999
C  -0.73194 -1.474189 -1.549092
C  0.778649 -3.064921 -0.296855
C  1.444166 2.745062 0.173443
C  -0.009905 2.475853 0.044728
C  -0.937209 2.11318 1.07375
C  -0.711633 2.436019 -1.111803
C  -2.124196 1.8910 0.461445
C  -3.452236 1.440884 0.953872
C  -3.707703 -0.008494 0.613281
C  -3.327919 -1.013681 1.498331
C  -4.277202 -0.366982 -0.605204
C  -3.520368 -2.35049 1.177846
C  -4.468259 -1.703656 -0.929737
C  -4.090325 -2.699396 -0.039346
H  3.656892 -1.756596 -1.502719
H  4.934435 0.040677 -0.594701
H  2.32946 -2.006642 2.153164
H  2.971522 -0.419337 2.538752
H  1.589238 -0.578364 1.455863
H  5.379283 -2.163298 0.101201
H  5.21237 -1.729479 1.801744
H  4.303414 -3.08979 1.145809
H  1.461123 -0.05865 -1.882329
H  -1.41678 -1.358949 -0.70486
H  -1.129463 -2.287811 -2.161416
H  -0.768711 -0.558106 -2.139026
H  0.135319 -3.065255 0.587377
H  1.796988 -3.275958 0.024484
H  0.446806 -3.904234 -0.914378
H  1.80038 3.346542 -0.664425
H  1.676114 3.278709 1.097259
H  -0.737679 2.031741 2.131105
H  -0.441124 2.633669 -2.137921
H  -4.240471 2.071616 0.534343
H  -3.475982 1.580423 2.035406
H  -2.880509 -0.748327 2.449494
H  -4.580842 0.403213 -1.304644
H  -3.225686 -3.120043 1.880194
H  -4.914395 -1.967104 -1.880471
H  -4.24139 -3.741302 -0.291425
elementType: O C H
totalener: -1079.74724915 hartree
nucrepener: 2235.41290531 hartree
electener: -3315.16015446 hartree
oneelecener: -5909.76688127 hartree
twoeener: 2594.60672681 hartree
cpcmener: -0.02711121 hartree
kineticenergy: 1074.86922604 hartree
xcener: -106.464928926004 hartree
chargesum: 0.0000000
charge: -0.254125 -0.480783 -0.273027 0.075015 -0.002641 -0.086869 -0.276992 -0.273189 -0.246901 0.389144 -0.002008 -0.222579 -0.273026 0.076273 -0.057045 -0.321536 -0.057220 0.201938 -0.068411 0.055419 -0.175350 -0.190875 -0.163833 -0.158472 -0.166095 0.111872 0.091174 0.092699 0.113609 0.090315 0.086963 0.099061 0.089910 0.107910 0.040819 0.109899 0.096994 0.096856 0.094555 0.108371 0.106168 0.114939 0.158902 0.174547 0.115953 0.109328 0.138065 0.137722 0.155183 0.155215 0.156158
qa: -0.2541 -0.4808 -0.2730 0.0750 -0.0026 -0.0869 -0.2770 -0.2732 -0.2469 0.3891 -0.0020 -0.2226 -0.2730 0.0763 -0.0570 -0.3215 -0.0572 0.2019 -0.0684 0.0554 -0.1754 -0.1909 -0.1638 -0.1585 -0.1661 0.1119 0.0912 0.0927 0.1136 0.0903 0.0870 0.0991 0.0899 0.1079 0.0408 0.1099 0.0970 0.0969 0.0946 0.1084 0.1062 0.1149 0.1589 0.1745 0.1160 0.1093 0.1381 0.1377 0.1552 0.1552 0.1562
va: 2.1015 2.0264 2.2664 3.7007 3.7989 3.8657 3.8818 3.9138 3.8564 4.1417 3.6344 3.9230 3.9443 3.8523 3.6901 3.9878 3.9179 3.6049 3.8205 3.5688 3.8881 3.9241 3.8741 3.8807 3.8644 1.0048 1.0270 0.9994 1.0024 1.0074 1.0056 1.0002 1.0036 1.0155 1.0110 1.0001 1.0088 0.9958 1.0053 1.0003 1.0092 0.9928 1.0074 0.9956 1.0075 1.0104 1.0045 1.0097 0.9924 0.9920 0.9911
dispcorr: -0.029619735 hartree
energy: -1079.776868884866
dipole: 5.10146 -6.30541 -1.20395 -19.00781 17.91758 -1.09024 3.34358 -2.82231 0.52127
magnitude: 1.70583 au
magnitude: 4.33587 debye
