program: Orca
programVersion: 5.0.2
elementType: O O O C C C C C C C C C C C C C C C C C C C C C C H H H H H H H H H H H H H H H H H H H H H H H H H H
charge: 0
multiplicity: 1
keywords: wb97x-d3
keywords: def2-TZVPP
keywords: def2/J RIJCOSX
keywords: DEFGRID2
keywords: scfconv7
keywords: smallprint printgap noloewdin
keywords: NOSOSCF
formula: C22H26O3
InChI: InChI=1/C22H26O3/c1-15(2)10-19-20(22(19,3)4)21(23)25-14-17-12-18(24-13-17)11-16-8-6-5-7-9-16/h5-10,12-13,19-20H,11,14H2,1-4H3
51 atoms
O  2.191642 2.081245 0.252867
O  1.789679 0.236281 1.446927
O  -1.700508 2.19296 -1.693939
C  4.527777 -0.796878 0.411936
C  3.552892 -1.128262 -0.662181
C  3.618576 0.301992 -0.101836
C  4.375881 -1.364857 1.801897
C  5.974809 -0.649773 0.001095
C  2.370493 -1.992091 -0.44089
C  2.456404 0.828514 0.631309
C  1.267102 -1.935889 -1.190704
C  0.09808 -2.832994 -0.931892
C  1.119897 -0.942881 -2.310093
C  0.983664 2.695173 0.731807
C  -0.193326 2.257944 -0.067643
C  -1.035033 1.112961 0.118918
C  -0.650793 2.867107 -1.187472
C  -1.931116 1.122064 -0.897399
C  -3.037372 0.205206 -1.293268
C  -3.845101 -0.275293 -0.115042
C  -3.890266 -1.621896 0.226184
C  -4.578699 0.633745 0.646018
C  -4.655904 -2.055847 1.302935
C  -5.343825 0.204753 1.718429
C  -5.385213 -1.144784 2.050932
H  3.966264 -1.179016 -1.66714
H  4.091155 1.026689 -0.754688
H  4.828936 -0.697596 2.537838
H  3.347417 -1.537507 2.104652
H  4.90176 -2.320167 1.862152
H  6.510557 0.015032 0.681798
H  6.478119 -1.61873 0.019054
H  6.075231 -0.244321 -1.006808
H  2.418567 -2.715178 0.3675
H  -0.793726 -2.246061 -0.690717
H  0.279945 -3.519418 -0.104972
H  -0.152883 -3.424788 -1.816162
H  0.199352 -1.102272 -2.872046
H  1.947991 -0.99974 -3.020309
H  1.098549 0.085497 -1.939002
H  1.151497 3.764465 0.608495
H  0.84501 2.499156 1.7957
H  -0.983153 0.386339 0.913827
H  -0.345281 3.760496 -1.710594
H  -2.633105 -0.654069 -1.836485
H  -3.691221 0.726813 -1.997448
H  -3.325962 -2.341516 -0.355741
H  -4.553027 1.68778 0.393444
H  -4.681492 -3.108697 1.553997
H  -5.912211 0.923399 2.29527
H  -5.984006 -1.480903 2.887749
elementType: O C H
totalener: -1079.74759598 hartree
nucrepener: 2191.32698960 hartree
electener: -3271.07458558 hartree
oneelecener: -5822.24203765 hartree
twoeener: 2551.16745208 hartree
cpcmener: -0.02528398 hartree
kineticenergy: 1074.85362158 hartree
xcener: -106.460435778139 hartree
chargesum: 0.0000000
charge: -0.287643 -0.467032 -0.276009 0.127376 -0.029285 -0.098402 -0.296997 -0.263858 -0.245757 0.385358 -0.017628 -0.188135 -0.295659 0.068191 -0.091805 -0.322098 -0.025037 0.223652 -0.046908 0.019710 -0.165329 -0.219998 -0.157763 -0.141346 -0.172042 0.112227 0.090940 0.099193 0.094767 0.098329 0.095257 0.093756 0.085711 0.120505 0.059055 0.089220 0.100270 0.101021 0.113699 0.092401 0.117619 0.116128 0.156148 0.173752 0.099302 0.117565 0.144942 0.143285 0.155564 0.156407 0.157380
qa: -0.2876 -0.4670 -0.2760 0.1274 -0.0293 -0.0984 -0.2970 -0.2639 -0.2458 0.3854 -0.0176 -0.1881 -0.2957 0.0682 -0.0918 -0.3221 -0.0250 0.2237 -0.0469 0.0197 -0.1653 -0.2200 -0.1578 -0.1413 -0.1720 0.1122 0.0909 0.0992 0.0948 0.0983 0.0953 0.0938 0.0857 0.1205 0.0591 0.0892 0.1003 0.1010 0.1137 0.0924 0.1176 0.1161 0.1561 0.1738 0.0993 0.1176 0.1449 0.1433 0.1556 0.1564 0.1574
va: 2.1039 2.0193 2.2788 3.7670 3.8199 3.8286 3.8903 3.8979 3.8083 4.1120 3.6648 3.9145 3.9656 3.8693 3.6509 3.9005 3.9483 3.5875 3.7815 3.6026 3.9002 3.9540 3.9227 3.8792 3.9044 1.0053 1.0325 1.0007 1.0186 0.9983 1.0026 1.0023 1.0048 1.0016 0.9973 1.0122 0.9957 1.0053 1.0016 0.9937 0.9961 1.0091 1.0200 0.9953 1.0021 1.0121 0.9986 1.0029 0.9923 0.9905 0.9904
dispcorr: -0.027410466 hartree
energy: -1079.775006441727
dipole: 14.09616 -13.84609 0.25007 -13.61832 13.88937 0.27105 -1.90589 1.10773 -0.79816
magnitude: 0.87924 au
magnitude: 2.23485 debye
