program: Orca
programVersion: 5.0.2
elementType: O O O C C C C C C C C C C C C C C C C C C C C C C H H H H H H H H H H H H H H H H H H H H H H H H H H
charge: 0
multiplicity: 1
keywords: wb97x-d3
keywords: def2-TZVPP
keywords: def2/J RIJCOSX
keywords: DEFGRID2
keywords: scfconv7
keywords: smallprint printgap noloewdin
keywords: NOSOSCF
formula: C22H26O3
InChI: InChI=1/C22H26O3/c1-15(2)10-19-20(22(19,3)4)21(23)25-14-17-12-18(24-13-17)11-16-8-6-5-7-9-16/h5-10,12-13,19-20H,11,14H2,1-4H3
51 atoms
O  2.121998 2.027992 -0.005274
O  2.194095 0.361199 1.479976
O  -2.134122 1.487385 -1.174921
C  4.91194 -0.424433 0.239591
C  3.904023 -0.991945 -0.697962
C  3.817944 0.485603 -0.279161
C  4.967224 -0.862318 1.682532
C  6.281761 -0.130215 -0.328499
C  2.868626 -1.968618 -0.28755
C  2.65662 0.919893 0.513359
C  1.737541 -2.163256 -0.971155
C  0.722241 -3.175004 -0.541816
C  1.409503 -1.363739 -2.201974
C  0.904584 2.526272 0.569956
C  -0.288844 1.837329 0.009412
C  -0.749884 0.497963 0.240417
C  -1.173287 2.378831 -0.860397
C  -1.86853 0.341916 -0.504181
C  -2.835816 -0.776051 -0.65152
C  -4.132919 -0.479972 0.062185
C  -5.203961 0.097965 -0.611211
C  -4.257282 -0.739614 1.424503
C  -6.378059 0.408411 0.062592
C  -5.429282 -0.432654 2.099776
C  -6.49402 0.144826 1.420097
H  4.233677 -1.094161 -1.729253
H  4.121014 1.19475 -1.04067
H  5.385722 -0.070077 2.306427
H  4.004992 -1.136743 2.103524
H  5.626428 -1.728332 1.772495
H  6.777009 0.663755 0.234349
H  6.916744 -1.017291 -0.27923
H  6.233781 0.183381 -1.372363
H  3.05516 -2.563769 0.600807
H  0.547301 -3.918511 -1.324361
H  -0.243595 -2.69818 -0.351844
H  1.020863 -3.702207 0.364368
H  0.416027 -1.599207 -2.582393
H  2.117973 -1.557508 -3.010734
H  1.439886 -0.289492 -2.011296
H  0.88223 3.583481 0.309088
H  0.93958 2.453251 1.65758
H  -0.313596 -0.247503 0.884655
H  -1.240319 3.352437 -1.321309
H  -2.37522 -1.673882 -0.237007
H  -3.024286 -0.97516 -1.709661
H  -5.123489 0.303692 -1.672166
H  -3.429124 -1.187558 1.961759
H  -7.2039 0.856345 -0.475345
H  -5.51209 -0.645738 3.15801
H  -7.409187 0.38543 1.945657
elementType: O C H
totalener: -1079.74906978 hartree
nucrepener: 2161.72001491 hartree
electener: -3241.46908470 hartree
oneelecener: -5762.92492258 hartree
twoeener: 2521.45583788 hartree
cpcmener: -0.02531206 hartree
kineticenergy: 1074.87731636 hartree
xcener: -106.465118418016 hartree
chargesum: 0.0000000
charge: -0.288704 -0.470378 -0.281996 0.130295 -0.033061 -0.098578 -0.296214 -0.264141 -0.250150 0.400474 -0.024586 -0.206480 -0.291338 0.071369 -0.074305 -0.356609 -0.036120 0.247471 -0.061718 0.055559 -0.201965 -0.205423 -0.154344 -0.151830 -0.171977 0.111345 0.090369 0.099590 0.093701 0.097598 0.095035 0.094315 0.085502 0.121286 0.104446 0.073846 0.090225 0.100481 0.115259 0.092565 0.114379 0.116713 0.160955 0.173597 0.117807 0.116010 0.138320 0.141893 0.155419 0.156481 0.157611
qa: -0.2887 -0.4704 -0.2820 0.1303 -0.0331 -0.0986 -0.2962 -0.2641 -0.2502 0.4005 -0.0246 -0.2065 -0.2913 0.0714 -0.0743 -0.3566 -0.0361 0.2475 -0.0617 0.0556 -0.2020 -0.2054 -0.1543 -0.1518 -0.1720 0.1113 0.0904 0.0996 0.0937 0.0976 0.0950 0.0943 0.0855 0.1213 0.1044 0.0738 0.0902 0.1005 0.1153 0.0926 0.1144 0.1167 0.1610 0.1736 0.1178 0.1160 0.1383 0.1419 0.1554 0.1565 0.1576
va: 2.1025 2.0141 2.2817 3.7731 3.8138 3.8371 3.8897 3.8972 3.8030 4.0879 3.6704 3.9100 3.9457 3.8710 3.6547 3.9900 3.9763 3.5935 3.8083 3.5830 3.9661 3.9430 3.8991 3.9026 3.9006 1.0037 1.0327 1.0006 1.0195 0.9987 1.0027 1.0024 1.0050 1.0026 0.9960 0.9964 1.0095 1.0055 1.0013 0.9993 0.9974 1.0081 1.0191 0.9947 1.0069 1.0072 1.0079 1.0036 0.9915 0.9913 0.9905
dispcorr: -0.026509355 hartree
energy: -1079.775579139236
dipole: 16.96864 -16.71589 0.25276 -12.42725 12.55070 0.12345 -2.25330 1.42235 -0.83094
magnitude: 0.87726 au
magnitude: 2.22982 debye
