program: Orca
programVersion: 5.0.2
elementType: O O O C C C C C C C C C C C C C C C C C C C C C C H H H H H H H H H H H H H H H H H H H H H H H H H H
charge: 0
multiplicity: 1
keywords: wb97x-d3
keywords: def2-TZVPP
keywords: def2/J RIJCOSX
keywords: DEFGRID2
keywords: scfconv7
keywords: smallprint printgap noloewdin
keywords: NOSOSCF
formula: C22H26O3
InChI: InChI=1/C22H26O3/c1-15(2)10-19-20(22(19,3)4)21(23)25-14-17-12-18(24-13-17)11-16-8-6-5-7-9-16/h5-10,12-13,19-20H,11,14H2,1-4H3
51 atoms
O  2.197015 2.028961 0.574866
O  1.715165 -0.004113 1.360794
O  -1.579405 2.378136 -1.460057
C  4.498917 -0.846815 0.245746
C  3.55032 -0.989012 -0.891721
C  3.5957 0.322004 -0.096438
C  4.312516 -1.637252 1.516436
C  5.954768 -0.633751 -0.101355
C  2.368814 -1.885596 -0.845736
C  2.422091 0.718886 0.699244
C  1.258563 -1.710783 -1.566532
C  0.103815 -2.65756 -1.462267
C  1.049919 -0.544573 -2.482487
C  0.986407 2.563869 1.133575
C  -0.184468 2.268193 0.261438
C  -1.158569 1.223008 0.380668
C  -0.497955 2.930295 -0.87726
C  -1.982964 1.338833 -0.688277
C  -3.150596 0.558016 -1.183552
C  -3.838626 -0.217236 -0.091813
C  -4.574465 0.450006 0.886112
C  -3.768184 -1.604998 -0.044062
C  -5.230418 -0.255092 1.883439
C  -4.422835 -2.315323 0.955567
C  -5.156934 -1.642781 1.920777
H  3.992095 -0.874646 -1.878567
H  4.07865 1.150007 -0.602109
H  4.75584 -1.108334 2.362408
H  3.275291 -1.842206 1.764062
H  4.825681 -2.597301 1.427385
H  6.479787 -0.117014 0.70459
H  6.454823 -1.590957 -0.263561
H  6.075965 -0.041136 -1.009332
H  2.424318 -2.744448 -0.183503
H  -0.126119 -3.112159 -2.429641
H  -0.801106 -2.129842 -1.145585
H  0.289453 -3.459506 -0.74767
H  0.375569 0.187118 -2.027029
H  0.57666 -0.859166 -3.415388
H  1.972538 -0.024198 -2.735191
H  1.165894 3.636682 1.185483
H  0.832462 2.202289 2.150749
H  -1.230157 0.489427 1.168081
H  -0.059726 3.785588 -1.36901
H  -2.825792 -0.127791 -1.972934
H  -3.863157 1.242574 -1.653648
H  -4.639555 1.531889 0.862247
H  -3.20225 -2.138773 -0.798752
H  -5.804907 0.277756 2.63069
H  -4.360486 -3.396072 0.975288
H  -5.672845 -2.194575 2.69628
elementType: O C H
totalener: -1079.74910139 hartree
nucrepener: 2193.94067373 hartree
electener: -3273.68977512 hartree
oneelecener: -5827.55669732 hartree
twoeener: 2553.86692219 hartree
cpcmener: -0.02542587 hartree
kineticenergy: 1074.85326197 hartree
xcener: -106.461162329110 hartree
chargesum: -0.0000000
charge: -0.289636 -0.466436 -0.279777 0.135428 -0.029706 -0.105348 -0.300575 -0.264455 -0.246791 0.392909 -0.018991 -0.194817 -0.267340 0.074782 -0.094610 -0.284000 -0.028787 0.188514 -0.042556 0.006386 -0.208012 -0.165546 -0.143921 -0.163356 -0.168401 0.108828 0.088870 0.098755 0.095898 0.097911 0.094685 0.094359 0.085775 0.119854 0.096965 0.059361 0.089831 0.079457 0.107078 0.101198 0.120613 0.115645 0.156650 0.171766 0.103309 0.116706 0.141985 0.150274 0.156725 0.155363 0.157181
qa: -0.2896 -0.4664 -0.2798 0.1354 -0.0297 -0.1053 -0.3006 -0.2645 -0.2468 0.3929 -0.0190 -0.1948 -0.2673 0.0748 -0.0946 -0.2840 -0.0288 0.1885 -0.0426 0.0064 -0.2080 -0.1655 -0.1439 -0.1634 -0.1684 0.1088 0.0889 0.0988 0.0959 0.0979 0.0947 0.0944 0.0858 0.1199 0.0970 0.0594 0.0898 0.0795 0.1071 0.1012 0.1206 0.1156 0.1567 0.1718 0.1033 0.1167 0.1420 0.1503 0.1567 0.1554 0.1572
va: 2.1112 2.0225 2.2663 3.7425 3.8293 3.8441 3.8938 3.8983 3.8404 4.1172 3.6914 3.9275 3.9660 3.8609 3.6519 3.8987 3.9342 3.6073 3.7921 3.5970 3.9497 3.9018 3.8852 3.9248 3.9016 1.0053 1.0326 1.0007 1.0177 0.9981 1.0027 1.0021 1.0046 1.0013 0.9990 1.0005 1.0106 0.9907 1.0024 1.0057 0.9954 1.0074 1.0153 0.9956 1.0042 1.0079 1.0023 0.9954 0.9906 0.9927 0.9904
dispcorr: -0.027153715 hartree
energy: -1079.776255109303
dipole: 13.66222 -13.43099 0.23123 -13.04977 13.47923 0.42946 -3.87865 3.23806 -0.64059
magnitude: 0.80514 au
magnitude: 2.04650 debye
